δωρεάν
type: Concept
source: CLARIN
definition: Δωρεάν
definition: Free @en
definition: libre @fr
definition: libero @it
definition: Gratis @nl
preferred label: free @en
preferred label: libre @fr
preferred label: libero @it
preferred label: gratis @nl
top concept of: SSHOC Multilingual Metadata

διαθεσιμότητα
type: Concept
source: CLARIN
definition: Περιγραφή των όρων διαθεσιμότητας του πόρου με απλά λόγια.
definition: A description of the terms of availability of the resource in simple words. @en
definition: Une description des conditions de disponibilité de la ressource en mots simples. @fr
definition: Una descrizione dei termini di disponibilità della risorsa in parole semplici. @it
definition: Een beschrijving van de voorwaarden voor beschikbaarheid van de bron in eenvoudige woorden. @nl
preferred label: availability @en
preferred label: disponibilité @fr
preferred label: disponibilità @it
preferred label: beschikbaarheid @nl
top concept of: SSHOC Multilingual Metadata

ονοματεπώνυμο επαφής
type: Concept
source: CLARIN
definition: Το όνομα του ατόμου με το οποίο μπορεί να επικοινωνήσει κανείς για να αποκτήσει πρόσβαση στον πόρο ή στο εργαλείο/υπηρεσία.
definition: The name of the person that can be contacted to get access to the resource or to the tool/service. @en
definition: Le nom de la personne qui peut être contactée pour obtenir l'accès à la ressource ou à l'outil/service. @fr
definition: Il nome della persona che può essere contattata per ottenere l'accesso alla risorsa o allo strumento/servizio. @it
definition: De naam van de persoon met wie contact kan worden opgenomen om toegang te krijgen tot de hulpbron of tot het hulpmiddel/de dienst. @nl
preferred label: contact full name @en
preferred label: nom complet du contact @fr
preferred label: nome completo del contatto @it
preferred label: volledige naam contactpersoon @nl
top concept of: SSHOC Multilingual Metadata

αριθμός φαξ
type: Concept
source: CLARIN
definition: Ο αριθμός φαξ ενός ατόμου ή ενός οργανισμού που εμπλέκεται στη δημιουργία, διαχείριση ή παροχή πρόσβασης σε πόρους ή εργαλεία/υπηρεσίες.
definition: The Fax number of a person or an organization that is involved in creating, managing or providing access to resources or tools/services. @en
definition: Le numéro de fax d'une personne ou d'une organisation impliquée dans la création, la gestion ou la fourniture d'un accès aux ressources ou aux outils/services. @fr
definition: Il numero di fax di una persona o di un'organizzazione che si occupa di creare, gestire o fornire l'accesso a risorse o strumenti/servizi. @it
definition: Het faxnummer van een persoon of een organisatie die betrokken is bij het creëren, beheren of verlenen van toegang tot middelen of instrumenten/diensten. @nl
preferred label: fax number @en
preferred label: numéro de fax @fr
preferred label: numero di fax @it
preferred label: faxnummer @nl
top concept of: SSHOC Multilingual Metadata

νομικό καθεστώς
type: Concept
source: CLARIN
definition: Περιγράφει το νομικό καθεστώς του οργανισμού που εμπλέκεται στη δημιουργία, διαχείριση ή παροχή πρόσβασης σε έναν πόρο ή ένα εργαλείο/υπηρεσία.
definition: Describes the legal status of the organization that is involved in creating, managing or providing access to a resource or a tool/service. @en
definition: Décrit le statut juridique de l'organisation qui est impliquée dans la création, la gestion ou la fourniture de l'accès à une ressource ou à un outil/service. @fr
definition: Descrive lo status giuridico dell'organizzazione coinvolta nella creazione, gestione o fornitura di accesso a una risorsa o uno strumento / servizio. @it
definition: Beschrijft de juridische status van de organisatie die betrokken is bij het creëren, beheren of verlenen van toegang tot een hulpbron of een hulpmiddel/dienst. @nl
preferred label: legal status @en
preferred label: statut juridique @fr
preferred label: status giuridico @it
preferred label: juridische status @nl
top concept of: SSHOC Multilingual Metadata

άδεια χρήσης
type: Concept
source: CLARIN
definition: Περιγραφή των όρων αδειοδότησης υπό τους οποίους μπορεί να χρησιμοποιηθεί ο πόρος.
definition: A description of the licensing conditions under which the resource can be used. @en
definition: Une description des conditions de licence sous lesquelles la ressource peut être utilisée. @fr
definition: Una descrizione delle condizioni di licenza sotto le quali la risorsa può essere usata. @it
definition: Een beschrijving van de licentievoorwaarden waaronder de bron kan worden gebruikt. @nl
preferred label: license @en
preferred label: licence @fr
preferred label: licenza @it
preferred label: licentie @nl
top concept of: SSHOC Multilingual Metadata

μέσο
type: Concept
source: CLARIN
definition: Το μέσο που χρησιμοποιείται για την πρόσβαση στον πόρο ή το εργαλείο.
definition: The medium that is used to access the resource or the tool. @en
definition: Le support qui est utilisé pour accéder à la ressource ou à l'outil. @fr
definition: Il mezzo utilizzato per accedere alla risorsa o allo strumento. @it
definition: Het medium dat wordt gebruikt om toegang te krijgen tot de bron of het hulpmiddel. @nl
preferred label: medium @en
preferred label: médium @fr
preferred label: mezzo @it
top concept of: SSHOC Multilingual Metadata

οργανισμός
type: Concept
source: CLARIN
definition: Ο οργανισμός που ηγήθηκε της δημιουργίας του έργου ή που είναι υπεύθυνος για την πρόσβαση στον πόρο και με τον οποίο συνεργάζεται ο υπεύθυνος επικοινωνίας του συγκεκριμένου πόρου.
definition: The organization that was leading the creation project or that is responsible for accessing the resource and the contact person is affiliated with. @en
definition: L'organisation qui a dirigé le projet de création ou qui est responsable de l'accès à la ressource et à laquelle la personne de contact est affiliée. @fr
definition: L'organizzazione che ha guidato il progetto di creazione o che è responsabile dell'accesso alla risorsa e la persona di contatto è affiliata. @it
definition: De organisatie die het creatieproject leidde of die verantwoordelijk is voor de toegang tot de bron en de contactpersoon die erbij aangesloten is. @nl
preferred label: organization @en
preferred label: organisation @fr
preferred label: organizzazione @it
preferred label: organisatie @nl
top concept of: SSHOC Multilingual Metadata

τιμή
type: Concept
source: CLARIN
definition: Το κόστος που απαιτείται για την πρόσβαση στον πόρο, σε ένα τμήμα του πόρου ή για τη χρήση του εργαλείου/υπηρεσίας.
definition: The costs that are required to access the resource, a fragment of the resource or to use the tool/service. @en
definition: Les coûts qui sont nécessaires pour accéder à la ressource, à un fragment de la ressource ou pour utiliser l'outil/service. @fr
definition: I costi che sono richiesti per accedere alla risorsa, un frammento della risorsa o per usare lo strumento/servizio. @it
definition: De kosten die nodig zijn om toegang te krijgen tot de bron, een fragment van de bron of om het hulpmiddel/de dienst te gebruiken. @nl
preferred label: price @en
preferred label: prix @fr
preferred label: prezzo @it
preferred label: prijs @nl
top concept of: SSHOC Multilingual Metadata

αριθμός τηλεφώνου
type: Concept
source: CLARIN
definition: Ο αριθμός τηλεφώνου ενός ατόμου ή ενός οργανισμού που εμπλέκεται/συμμετέχει στη δημιουργία και διαχείριση πόρου ή στην πρόσβαση σε πόρο.
definition: The telephone number of a person or an organization that is involved in creating, managing or accessing the resource. @en
definition: Le numéro de téléphone d'une personne ou d'une organisation qui participe à la création, à la gestion ou à l'accès à la ressource. @fr
definition: Il numero di telefono di una persona o di un'organizzazione coinvolta nella creazione, gestione o accesso alla risorsa. @it
definition: Het telefoonnummer van een persoon of een organisatie die betrokken is bij de creatie, het beheer of de toegang tot de bron. @nl
preferred label: telephone number @en
preferred label: numéro de téléphone @fr
preferred label: numero di telefono @it
preferred label: telefoonnummer @nl
top concept of: SSHOC Multilingual Metadata

τύπος επιπέδου επισημείωσης
type: Concept
source: PWittenburg
definition: Προσδιορισμός των τύπων επιπέδων επισημείωσης (tiers) που παρέχονται από τον πόρο.
definition: Specification of the types of annotation levels (tiers) provided by the resource. @en
definition: Spécification des types de niveaux d’annotation (tiers) fournis par la ressource. @fr
definition: Specificazione dei tipi di livelli di annotazione (tiers) forniti dalla risorsa. @it
definition: Specificatie van de types annotatieniveaus (tiers) die door de bron worden verschaft. @nl
preferred label: annotation level type @en
preferred label: type de niveau d'annotation @fr
preferred label: tipo di livello di annotazione @it
preferred label: type annotatieniveau @nl
top concept of: SSHOC Multilingual Metadata

κανάλι
type: Concept
source: CLARIN
definition: Υποδεικνύει το κανάλι επικοινωνίας.
definition: Indicates the channel of the communication. @en
definition: Indique le canal de la communication. @fr
definition: Indica il canale della comunicazione. @it
definition: Geeft het kanaal van de communicatie aan. @nl
preferred label: channel @en
preferred label: canal @fr
preferred label: canale @it
preferred label: kanaal @nl
top concept of: SSHOC Multilingual Metadata

μορφότυπο διάθεσης
type: Concept
source: CLARIN
definition: Ορίζει το μορφότυπο που χρησιμοποιήθηκε για την διάθεση του πόρου.
definition: Specifies the format used for the delivery of the resource. @en
definition: Spécifie le format utilisé pour la livraison de la ressource. @fr
definition: Specifica il formato utilizzato per la consegna della risorsa. @it
definition: Geeft het formaat aan dat voor de levering van de bron is gebruikt. @nl
preferred label: delivery format @en
preferred label: format de livraison @fr
preferred label: formato di consegna @it
preferred label: leveringsformaat @nl
top concept of: SSHOC Multilingual Metadata

διάλεκτος
type: Concept
source: CLARIN
definition: Ονόματα των διαλέκτων που εμφανίζονται στον πόρο.
definition: Names of the dialects that occur in the resource. @en
definition: Noms des dialectes qui apparaissent dans la ressource. @fr
definition: Nomi dei dialetti che si trovano nella risorsa. @it
definition: Namen van de dialecten die in de bron voorkomen. @nl
preferred label: dialect @en
preferred label: dialecte @fr
preferred label: dialetto @it
top concept of: SSHOC Multilingual Metadata

τομέας
type: Concept
source: CLARIN
definition: Υποδεικνύει τον τομέα εφαρμογής του πόρου ή του εργαλείου/υπηρεσίας.
definition: Indicates the application domain of the resource or the tool/service. @en
definition: Indique le domaine d'application de la ressource ou de l'outil/service. @fr
definition: Indica il dominio dell'applicazione della risorsa o dello strumento/servizio. @it
definition: Geeft het toepassingsdomein van de bron of het hulpprogramma/de dienst aan. @nl
preferred label: domain @en
preferred label: domaine @fr
preferred label: dominio @it
preferred label: domein @nl
top concept of: SSHOC Multilingual Metadata

κυρίαρχη γλώσσα
type: Concept
source: CLARIN
definition: Προσδιορίζει την πιο συχνά χρησιμοποιούμενη γλώσσα σε έναν πόρο.
definition: Specifies the most frequently used language in a resource. @en
definition: Spécifie la langue la plus fréquemment utilisée dans une ressource. @fr
definition: Specifica la lingua più usata in una risorsa. @it
definition: Geeft de meest gebruikte taal in een bron aan. @nl
preferred label: dominant language @en
preferred label: lingua dominante @it
preferred label: dominante taal @nl
top concept of: SSHOC Multilingual Metadata

δομή εκδήλωσης
type: Concept
source: CLARIN
definition: Υποδεικνύει τη δομή του συμβάντος επικοινωνίας.
definition: Indicates the structure of the communication event. @en
definition: Indique la structure de l'événement de communication. @fr
definition: Indica la struttura dell'evento di comunicazione. @it
definition: Aanduiding van de structuur van de communicatiegebeurtenis. @nl
preferred label: event structure @en
preferred label: structure événementielle @fr
preferred label: struttura dell'evento @it
preferred label: evenement structuur @nl
top concept of: SSHOC Multilingual Metadata

είδος
type: Concept
source: CLARIN
definition: To συμβατικό είδος λόγου ή τα κειμενικά είδη του περιεχομένου του πόρου, βασισμένα σε εξωγλωσσικά ή ενδογλωσσικά κριτήρια.
definition: The conventionalized discourse or text types of the content of the resource, based on extra-linguistic and internal linguistic criteria. @en
definition: Les types de discours ou de textes conventionnels du contenu de la ressource, basés sur des critères extra-linguistiques et linguistiques internes. @fr
definition: I tipi di discorso o testo convenzionali del contenuto della risorsa, basati su criteri linguistici interni ed extra-linguistici. @it
definition: De geconventionaliseerde discours- of teksttypes van de inhoud van de bron, gebaseerd op extra-linguïstische en interne linguïstische criteria. @nl
preferred label: genre @en
preferred label: genere @it
top concept of: SSHOC Multilingual Metadata

γεωγραφική κάλυψη
type: Concept
source: CLARIN
definition: Η γεωγραφική περιοχή από την οποία είναι ή στην οποία αναφέρεται το περιεχόμενο.
definition: The geographic scope that the content of a resources is from or about. @en
definition: La portée géographique du contenu d’une ressource. @fr
definition: L'ambito geografico da cui proviene il contenuto di una risorsa. @it
definition: Het geografische bereik waaruit of waarover de inhoud van een bron afkomstig is. @nl
preferred label: geographic coverage @en
preferred label: couverture géographique @fr
preferred label: copertura geografica @it
preferred label: geografische dekking @nl
top concept of: SSHOC Multilingual Metadata

διαδραστικότητα
type: Concept
source: CLARIN
definition: Χαρακτηρίζει το βαθμό αλληλεπίδρασης μεταξύ όλων των συμμετεχόντων στον πόρο.
definition: Characterizes the degree of interactivity between all the participants in the resource. @en
definition: Caractérise le degré d'interactivité entre tous les participants à la ressource. @fr
definition: Caratterizza il grado di interattività tra tutti i partecipanti alla risorsa. @it
definition: Kenmerkt de mate van interactiviteit tussen alle deelnemers aan de bron. @nl
preferred label: interactivity @en
preferred label: interactivité @fr
preferred label: interattività @it
preferred label: interactiviteit @nl
top concept of: SSHOC Multilingual Metadata

συμμετοχή
type: Concept
source: CLARIN
definition: Δείχνει σε ποιο βαθμό ο ερευνητής συμμετείχε στο γλωσσικό γεγονός.
definition: Indicates in how far the researcher was involved in the linguistic event. @en
definition: Indique dans quelle mesure le chercheur a été impliqué dans l'événement linguistique. @fr
definition: Indica in che misura il ricercatore è stato coinvolto nell'evento linguistico. @it
definition: Geeft aan in welke mate de onderzoeker betrokken was bij het linguïstische gebeuren. @nl
preferred label: involvement @en
preferred label: participation @fr
preferred label: coinvolgimento @it
preferred label: betrokkenheid @nl
top concept of: SSHOC Multilingual Metadata

αναγνωριστικό γλώσσας
type: Concept
source: CLARIN
definition: Αναγνωριστικό της γλώσσας όπως ορίζεται από το ISO 639 που περιλαμβάνεται στον πόρο ή υποστηρίζεται από το εργαλείο/υπηρεσία.
definition: Identifier of the language as defined by ISO 639 that is included in the resource or supported by the tool/service. @en
definition: Identificateur de la langue telle que définie par la norme ISO 639 qui est incluse dans la ressource ou prise en charge par l'outil/service. @fr
definition: Identificatore della lingua come definita da ISO 639 che è inclusa nella risorsa o supportata dallo strumento/servizio. @it
definition: Identifier van de taal zoals gedefinieerd door ISO 639 die is opgenomen in de bron of ondersteund wordt door het hulpmiddel/de dienst. @nl
preferred label: language ID @en
preferred label: identification de la langue @fr
preferred label: ID della lingua @it
preferred label: taal-ID @nl
top concept of: SSHOC Multilingual Metadata

γλώσσα σε
type: Concept
source: CLARIN
definition: Αναγνωριστικό της γλώσσας στην οποία είναι γραμμένη η περιγραφή του πόρου.
definition: An identifier of the language in which the description of the resource is written. @en
definition: Un identifiant de la langue dans laquelle la description de la ressource est écrite. @fr
definition: Un identificatore della lingua in cui è scritta la descrizione della risorsa. @it
definition: Een identificatie van de taal waarin de beschrijving van de bron is geschreven. @nl
preferred label: language in @en
preferred label: langue en @fr
preferred label: lingua in @it
preferred label: taal in @nl
top concept of: SSHOC Multilingual Metadata

όνομα γλώσσας
type: Concept
source: CLARIN
definition: Ένα κατανοητό από τον άνθρωπο όνομα της γλώσσας που χρησιμοποιείται στον πόρο ή υποστηρίζεται από το εργαλείο/την υπηρεσία.
definition: A human understandable name of the language that is used in the resource or supported by the tool/service. @en
definition: Un nom compréhensible par l'homme de la langue qui est utilisée dans la ressource ou prise en charge par l'outil/service. @fr
definition: Un nome comprensibile all'uomo della lingua usata nella risorsa o supportata dallo strumento/servizio. @it
definition: Een voor mensen begrijpelijke naam van de taal die in de bron wordt gebruikt of door het hulpmiddel/de dienst wordt ondersteund. @nl
preferred label: language name @en
preferred label: nom de la langue @fr
preferred label: nome della lingua @it
preferred label: taal naam @nl
top concept of: SSHOC Multilingual Metadata

αλφάβητο
type: Concept
source: CLARIN
definition: Ένδειξη του συστήματος γραφής που χρησιμοποιείται για την αναπαράσταση της γλώσσας με τη μορφή τετραψήφιου κώδικα, όπως ορίζεται στο ISO-15924.
definition: Indication of the writing system used to represent the language in form of a four letter code as it is defined in ISO-15924. @en
definition: Indication du système d'écriture utilisé pour représenter la langue sous la forme d'un code de quatre lettres tel qu'il est défini dans la norme ISO-15924. @fr
definition: Indicazione del sistema di scrittura usato per rappresentare la lingua sotto forma di un codice di quattro lettere come è definito in ISO-15924. @it
definition: Aanduiding van het schrijfsysteem dat wordt gebruikt om de taal weer te geven in de vorm van een vierlettercode zoals gedefinieerd in ISO-15924. @nl
preferred label: language script @en
preferred label: système d'écriture @fr
preferred label: sistema di scrittura @it
preferred label: taalscript @nl
top concept of: SSHOC Multilingual Metadata

λεξιλογική μονάδα
type: Concept
source: CLARIN
definition: Αναφέρετε τις λέξεις κεφαλής που χρησιμοποιούνται στο Λεξικό.
definition: Indicate the type(s) of headword(s) used in the Lexicon. @en
definition: Indique le(s) type(s) de vedette(s) utilisé(s) dans le lexique. @fr
definition: Indica il tipo(i) di lemma(i) usato(i) nel lessico. @it
definition: Geef aan welk(e) type(n) trefwoord(en) in het Lexicon wordt/worden gebruikt. @nl
preferred label: lexical unit @en
preferred label: unité lexicale @fr
preferred label: unità lessicale @it
preferred label: lexicale eenheid @nl
top concept of: SSHOC Multilingual Metadata

τύπος λεξικού
type: Concept
source: CLARIN
definition: Περιγραφή του τύπου του λεξικού.
definition: A description of the type of the lexicon. @en
definition: Une description du type de lexique. @fr
definition: Una descrizione del tipo di lessico. @it
definition: Een beschrijving van het type van het lexicon. @nl
preferred label: lexicon type @en
preferred label: type de lexique @fr
preferred label: tipo di lessico @it
top concept of: SSHOC Multilingual Metadata

πληροφορίες κύριου επιπέδου
type: Concept
source: Peter Wittenburg
definition: Επίπεδο πληροφοριών που υποδεικνύει το είδος των λεξικών χαρακτηριστικών που μπορούν να βρεθούν στο λεξικό (ορθογραφία, προφορά, μορφολογία κ.λπ.).
definition: Information level that indicates the type of lexical attributes that can be found in the lexicon (orthography, pronunciation, morphology etc). @en
definition: Niveau d'information qui indique le type d'attributs lexicaux que l'on peut trouver dans le lexique (orthographe, prononciation, morphologie, etc.). @fr
definition: Livello di informazione che indica il tipo di attributi lessicali che si possono trovare nel lessico (ortografia, pronuncia, morfologia, ecc.). @it
definition: Informatieniveau dat het soort lexicale attributen aangeeft dat in het lexicon kan worden gevonden (orthografie, uitspraak, morfologie, enz.). @nl
preferred label: main level information @en
preferred label: l'information du niveau principal @fr
preferred label: informazioni di livello principale @it
preferred label: informatie op hoofdniveau @nl
top concept of: SSHOC Multilingual Metadata

μετα-γλώσσα
type: Concept
source: CLARIN
definition: Όνομα της γλώσσας που χρησιμοποιείται ως μεταγλώσσα στον πόρο.
definition: Name of the language that is used as a metalanguage in the resource. @en
definition: Nom de la langue qui est utilisée comme métalangage dans la ressource. @fr
definition: Nome della lingua che è usata come metalinguaggio nella risorsa. @it
definition: Naam van de taal die in de bron als metataal wordt gebruikt. @nl
preferred label: meta language @en
preferred label: méta-langue @fr
preferred label: meta linguaggio @it
preferred label: metataal @nl
top concept of: SSHOC Multilingual Metadata

τροπικότητα/ες
type: Concept
source: CLARIN
definition: Κατάλογος τροπικότητας που εμπεριέχεται στην καταγραφή ώστε να μπορεί να αποτελέσει αντικείμενο ανάλυσης ή να υποστηριχθεί από το εργαλείο/υπηρεσία.
definition: A listing of all modalities that are contained in the recording such that they can be subject of analysis or that are supported by the tool/service. @en
definition: Une liste de toutes les modalités qui sont contenues dans l'enregistrement de manière à ce qu'elles puissent faire l'objet d'une analyse ou qui sont prises en charge par l'outil/service. @fr
definition: Un elenco di tutte le modalità che sono contenute nella registrazione in modo che possano essere oggetto di analisi o che siano supportate dallo strumento/servizio. @it
definition: Een opsomming van alle modaliteiten die de opname bevat, zodat ze kunnen worden geanalyseerd of door het hulpmiddel/de dienst worden ondersteund. @nl
preferred label: modalities @en
preferred label: modalités @fr
preferred label: modalità @it
preferred label: modaliteiten @nl
top concept of: SSHOC Multilingual Metadata

αριθμός γλωσσών
type: Concept
source: CLARIN
definition: Ένδειξη του αριθμού των γλωσσών που περιλαμβάνονται στον πόρο.
definition: An indication of the number of languages that are included in the resource. @en
definition: Une indication du nombre de langues qui sont incluses dans la ressource. @fr
definition: Un'indicazione del numero di lingue che sono incluse nella risorsa. @it
definition: Een indicatie van het aantal talen dat in de bron is opgenomen. @nl
preferred label: number of languages @en
preferred label: nombre de langues @fr
preferred label: numero di lingue @it
preferred label: aantal talen @nl
top concept of: SSHOC Multilingual Metadata

τύπος σχεδιασμού
type: Concept
source: CLARIN
definition: Δείχνει σε ποιο βαθμό έχει προετοιμάσει το γλωσσικό γεγονός ο σύμβουλος
definition: Indicates in how far the consultant planned the linguistic event. @en
definition: Indique dans quelle mesure le consultant a planifié l'événement linguistique. @fr
definition: Indica in che misura il consulente ha pianificato l'evento linguistico. @it
definition: Geeft aan in welke mate de consulent de taalkundige gebeurtenis heeft gepland. @nl
preferred label: planning type @en
preferred label: type de planification @fr
preferred label: tipo di pianificazione @it
preferred label: type planning @nl
top concept of: SSHOC Multilingual Metadata

κοινωνικό πλαίσιο
type: Concept
source: CLARIN
definition: Ένδειξη του κοινωνικού πλαισίου στο οποίο έλαβε χώρα το γεγονός.
definition: Indicates the social context the event took place in. @en
definition: Indique le contexte social dans lequel l'événement a eu lieu. @fr
definition: Indica il contesto sociale in cui l'evento ha avuto luogo. @it
definition: Geeft de sociale context aan waarin de gebeurtenis plaatsvond. @nl
preferred label: social context @en
preferred label: contexte social @fr
preferred label: contesto sociale @it
preferred label: sociale context @nl
top concept of: SSHOC Multilingual Metadata

γλώσσα προέλευσης
type: Concept
source: CLARIN
definition: Δείχνει αν μια γλώσσα είναι γλώσσα-πηγή. (boolean)
definition: Indicates if a language is a source language. (boolean) @en
definition: Indique si une langue est une langue source. (booléen) @fr
definition: Indica se una lingua è una lingua di partenza. (booleano) @it
definition: Geeft aan of een taal een brontaal is. (booleaans) @nl
preferred label: source language @en
preferred label: langue source @fr
preferred label: lingua di origine @it
preferred label: brontaal @nl
top concept of: SSHOC Multilingual Metadata

δομικές μονάδες
type: Concept
source: CLARIN
definition: Ένδειξη των δομικών μονάδων που επισημαίνονται στον πόρο.
definition: Indication of the structural units that are marked up in the resource. @en
definition: Indication des unités structurelles qui sont balisées dans la ressource. @fr
definition: Indicazione delle unità strutturali che sono marcate nella risorsa. @it
definition: Aanduiding van de structurele eenheden die in de bron zijn gemarkeerd. @nl
preferred label: structural units @en
preferred label: unités structurelles @fr
preferred label: unità strutturali @it
preferred label: structurele eenheden @nl
top concept of: SSHOC Multilingual Metadata

πληροφορίες υποεπιπέδου
type: Concept
source: CLARIN
definition: Ένδειξη των πληροφοριών υποεπιπέδου που περιέχονται στο λεξικό και χαρακτηρίζουν τις πληροφορίες του κύριου επιπέδου.
definition: Indicate the sub-level information that is contained in the lexicon that qualifies the main level information. @en
definition: Indiquez les informations de sous-niveau qui sont contenues dans le lexique et qui qualifient les informations de niveau principal. @fr
definition: Indica l'informazione di sottolivello contenuta nel lessico che qualifica l'informazione di livello principale. @it
definition: Geef de informatie op het subniveau aan die is opgenomen in het lexicon dat de informatie op het hoofdniveau kwalificeert. @nl
preferred label: sub-level information @en
preferred label: informations de sous-niveau @fr
preferred label: informazioni sui sottolivelli @it
preferred label: informatie op subniveau @nl
top concept of: SSHOC Multilingual Metadata

σύνολο ετικετών
type: Concept
source: CLARIN
definition: Καθορίζει το σύνολο ετικετών που χρησιμοποιείται στην επισημείωση του πόρου ή που χρησιμοποιείται από το εργαλείο/υπηρεσία ή περιέχει μια διεύθυνση URL που παραπέμπει σε πληροφορίες σχετικά με το σύνολο ετικετών.
definition: Specifies the tag set used in the annotation of the resource or a used by the tool/service or it contains a URL that points to the information about the tag set. @en
definition: Spécifie le jeu de balises utilisé dans l'annotation de la ressource ou utilisé par l'outil/service ou contient une URL qui pointe vers les informations sur le jeu de balises. @fr
definition: Specifica il set di tag utilizzato nell'annotazione della risorsa o utilizzato dallo strumento/servizio oppure contiene un URL che punta alle informazioni sul set di tag. @it
definition: Specificeert de tagset die gebruikt wordt in de annotatie van de bron of die gebruikt wordt door de tool/dienst of het bevat een URL die verwijst naar de informatie over de tagset. @nl
preferred label: tagset @en
top concept of: SSHOC Multilingual Metadata

γλώσσα συνόλου ετικετών
type: Concept
source: CLARIN
definition: Δείχνει τη γλώσσα του ίδιου του συνόλου ετικετών, που εκφράζεται με τους γλωσσικούς κώδικες δύο γραμμάτων του iso639.
definition: Indicates the language of the tag set itself, expressed in the two-letter language codes of iso639. @en
definition: Indique la langue de l'ensemble de balises lui-même, exprimée dans les codes de langue à deux lettres de l'iso639. @fr
definition: Indica la lingua dell'insieme di tag stesso, espressa nei codici di lingua a due lettere di iso639. @it
definition: Geeft de taal van de tag-verzameling zelf aan, uitgedrukt in de tweeletterige taalcodes van iso639. @nl
preferred label: tagset language @en
preferred label: langage de balises @fr
preferred label: lingua del tagset @it
preferred label: taal van de labelset @nl
top concept of: SSHOC Multilingual Metadata

γλώσσα-στόχος
type: Concept
source: CLARIN
definition: Δείχνει αν η γλώσσα είναι η γλώσσα-στόχος.
definition: Indicates if the language is the target language. @en
definition: Indique si la langue est la langue cible. @fr
definition: Indica se la lingua è la lingua di destinazione. @it
definition: Geeft aan of de taal de doeltaal is. @nl
preferred label: target language @en
preferred label: langue cible @fr
preferred label: lingua di destinazione @it
preferred label: doeltaal @nl
top concept of: SSHOC Multilingual Metadata

εργασία
type: Concept
source: CLARIN
definition: Η κύρια εργασία που εκτελείται στον πόρο ή μια τυπική περιγραφή εργασίας του εργαλείου/υπηρεσίας.
definition: The major task carried out in the resource or a typical task description of the tool/service. @en
definition: La principale tâche effectuée dans la ressource ou une description de tâche typique de l'outil/service. @fr
definition: Il compito principale svolto nella risorsa o una descrizione del compito tipico dello strumento/servizio. @it
definition: De belangrijkste taak die in de bron wordt uitgevoerd of een typische taakbeschrijving van het hulpmiddel/de dienst. @nl
preferred label: task @en
preferred label: tâche @fr
preferred label: compito @it
preferred label: taak @nl
top concept of: SSHOC Multilingual Metadata

θεωρητικό μοντέλο
type: Concept
source: CLARIN
definition: Όνομα του θεωρητικού μοντέλου πίσω από το έργο επισημείωσης ή/και αναφορά (URL ή βιβλιογραφική αναφορά) σε πληροφοριακό υλικό σχετικά με το θεωρητικό μοντέλο που χρησιμοποιήθηκε.
definition: Name of the theoretic model underlying the annotation task and/or reference (URL or bibliographic reference) to informative material about the theoretic model used. @en
definition: Nom du modèle théorique qui sous-tend la tâche d'annotation et/ou référence (URL ou référence bibliographique) à du matériel informatif sur le modèle théorique utilisé. @fr
definition: Nome del modello teorico sottostante il compito di annotazione e/o riferimento (URL o riferimento bibliografico) a materiale informativo sul modello teorico utilizzato. @it
definition: Naam van het theoretische model dat aan de annotatietaak ten grondslag ligt en/of verwijzing (URL of bibliografische referentie) naar informatief materiaal over het gebruikte theoretische model. @nl
preferred label: theoretic model @en
preferred label: modèle théorique @fr
preferred label: modello teorico @it
preferred label: theoretisch model @nl
top concept of: SSHOC Multilingual Metadata

χρονική κάλυψη
type: Concept
source: CLARIN
definition: Η χρονική περίοδος την οποία αφορά το περιεχόμενο ενός πόρου.
definition: The time period that the content of a resource is about. @en
definition: La période sur laquelle porte le contenu d'une ressource. @fr
definition: Il periodo di tempo che riguarda il contenuto di una risorsa. @it
definition: De tijdsperiode waar de inhoud van een bron over gaat. @nl
preferred label: time coverage @en
preferred label: couverture temporelle @fr
preferred label: copertura temporale @it
preferred label: tijdsbesteding @nl
top concept of: SSHOC Multilingual Metadata

θέμα
type: Concept
source: CLARIN
definition: Περιγράφει τον τομέα γνώσης του πόρου.
definition: Describes the knowledge domain of the resource. @en
definition: Décrit le domaine de connaissances de la ressource. @fr
definition: Descrive il dominio di conoscenza della risorsa. @it
definition: Beschrijft het kennisdomein van de bron. @nl
preferred label: topic @en
preferred label: sujet @fr
preferred label: argomento @it
preferred label: onderwerp @nl
top concept of: SSHOC Multilingual Metadata

μέγεθος λεξιλογίου
type: Concept
source: CLARIN
definition: Ένδειξη του μεγέθους του λεξιλογίου που χρησιμοποιείται στον πόρο.
definition: Indication of the size of the vocabulary used in the resource. @en
definition: Indication de la taille du vocabulaire utilisé dans la ressource. @fr
definition: Indicazione della dimensione del vocabolario usato nella risorsa. @it
definition: Indicatie van de grootte van het vocabularium dat in de bron wordt gebruikt. @nl
preferred label: vocabulary size @en
preferred label: taille du vocabulaire @fr
preferred label: dimensione del vocabolario @it
preferred label: woordenschatgrootte @nl
top concept of: SSHOC Multilingual Metadata

διεύθυνση
type: Concept
source: PWittenburg
definition: Η διεύθυνση ενός οργανισμού που συμμετείχε/συμμετέχει στη δημιουργία, διαχείριση και πρόσβαση σε πόρο ή εργαλείο/υπηρεσία.
definition: The address of an organization that was/is involved in creating, managing and accessing resource or tool/service. @en
definition: L'adresse d'une organisation qui a été/est impliquée dans la création, la gestion et l'accès à la ressource ou à l'outil/service. @fr
definition: L'indirizzo di un'organizzazione che era/è coinvolta nella creazione, gestione e accesso alla risorsa o allo strumento/servizio. @it
definition: Het adres van een organisatie die betrokken was/is bij de creatie, het beheer en de toegang tot de bron of het instrument/de dienst. @nl
preferred label: address @en
preferred label: adresse @fr
preferred label: indirizzo @it
preferred label: adres @nl
top concept of: SSHOC Multilingual Metadata

τρόπος επισημείωσης
type: Concept
source: CLARIN
definition: Σήμανση που δείχνει/δηλώνει εάν ο πόρος δημιουργήθηκε με το χέρι (χειρωνακτικά) ή με αυτόματες διαδικασίες.
definition: Flag that indicates whether the resource was created manually or by automatic processes. @en
definition: Indicateur indiquant si la ressource a été créée manuellement ou par des processus automatiques. @fr
definition: Flag che indica se la risorsa è stata creata manualmente o da processi automatici. @it
definition: Vlag die aangeeft of de bron handmatig of door middel van automatische processen is aangemaakt. @nl
preferred label: annotation mode @en
preferred label: mode annotation @fr
preferred label: modalità di annotazione @it
preferred label: annotatiewijze @nl
top concept of: SSHOC Multilingual Metadata

εξ αποστάσεως επισημείωση (stand-off annotation)
type: Concept
source: CLARIN
definition: Δείχνει εάν η επισημείωση είναι ενσωματωμένη ή δημιουργήθηκε ξεχωριστά.
definition: Indicates whether the annotation was created inline or in a stand-off fashion. @en
definition: Indique si l'annotation a été créée en ligne ou de façon isolée. @fr
definition: Indica se l'annotazione è stata creata in linea o in modo indipendente. @it
definition: Aanduiding of de annotatie inline of op een stand-off manier is aangemaakt. @nl
preferred label: annotation stand-off @en
preferred label: annotazione stand-off @it
preferred label: annotatie stand-off @nl
top concept of: SSHOC Multilingual Metadata

ροή εργασιών επισημείωσης
type: Concept
source: CLARIN
definition: Ένδειξη της διαδικασίας ροής εργασίας στην οποία ενσωματώθηκε η διαδικασία δημιουργίας.
definition: Indication of the workflow process in which the creation process was embedded. @en
definition: Indication du processus de flux de travail dans lequel le processus de création a été intégré. @fr
definition: Indicazione del processo di flusso di lavoro in cui il processo di creazione è stato incorporato. @it
definition: Aanduiding van het workflowproces waarin het creatieproces was ingebed. @nl
preferred label: annotation workflow @en
preferred label: flux de travail d'annotation @fr
preferred label: flusso di lavoro di annotazione @it
preferred label: annotatie workflow @nl
top concept of: SSHOC Multilingual Metadata

έτος ολοκλήρωσης
type: Concept
source: CLARIN
definition: Το έτος κατά το οποίο ολοκληρώθηκε η διαδικασία δημιουργίας.
definition: The year in which the creation process was completed. @en
definition: L'année au cours de laquelle le processus de création a été achevé. @fr
definition: L'anno in cui il processo di creazione è stato completato. @it
definition: Het jaar waarin het creatieproces werd voltooid. @nl
preferred label: completion year @en
preferred label: Année d'achèvement @fr
preferred label: anno di completamento @it
preferred label: jaar van voltooiing @nl
top concept of: SSHOC Multilingual Metadata

ημερομηνία δημιουργίας
type: Concept
source: CLARIN
definition: Η ημερομηνία κατά την οποία δημιουργήθηκε ο πόρος ή το εργαλείο/υπηρεσία.
definition: The date when the resource or tool/service was created. @en
definition: La date à laquelle la ressource ou l'outil/service a été créé. @fr
definition: La data in cui la risorsa o lo strumento/servizio è stato creato. @it
definition: De datum waarop de bron of het hulpmiddel/de dienst werd gecreëerd. @nl
preferred label: creation date @en
preferred label: date de création @fr
preferred label: data di creazione @it
preferred label: aanmaakdatum @nl
top concept of: SSHOC Multilingual Metadata

εργαλείο δημιουργίας
type: Concept
source: CLARIN
definition: Ορίζει το εργαλείο με τη βοήθεια του οποίου δημιουργήθηκε ο πόρος ή οι επισημειώσεις στον πόρο.
definition: Indicates the tool with help of which the resource or the annotations in the resource were created. @en
definition: Indique l'outil à l'aide duquel la ressource ou les annotations de la ressource ont été créées. @fr
definition: Indica lo strumento con l'aiuto del quale la risorsa o le annotazioni nella risorsa sono state create. @it
definition: Aanduiding van het hulpmiddel waarmee de bron of de annotaties in de bron zijn gemaakt. @nl
preferred label: creation tool @en
preferred label: outil de création @fr
preferred label: strumento di creazione @it
preferred label: tool voor het maken van bestanden @nl
top concept of: SSHOC Multilingual Metadata

ονοματεπώνυμο δημιουργού
type: Concept
source: CLARIN
definition: Το όνομα του ατόμου που συμμετείχε στη δημιουργία του έργου.
definition: The name of the person who was participating in the creation project. @en
definition: Le nom de la personne qui a participé au projet de création. @fr
definition: Il nome della persona che partecipava al progetto di creazione. @it
definition: De naam van de persoon die meewerkte aan het creatieproject. @nl
preferred label: creator full name @en
preferred label: nom complet du créateur @fr
preferred label: nome completo del creatore @it
preferred label: volledige naam van de maker @nl
top concept of: SSHOC Multilingual Metadata

ρόλος του δημιουργού
type: Concept
source: CLARIN
definition: Ο ρόλος που είχε ένα άτομο στη διαδικασία δημιουργίας.
definition: The role that a person had in the creation process. @en
definition: Le rôle qu'une personne avait dans le processus de création. @fr
definition: Il ruolo che una persona ha avuto nel processo di creazione. @it
definition: De rol die een persoon had in het creatieproces. @nl
preferred label: creator role @en
preferred label: rôle de créateur @fr
preferred label: ruolo di creatore @it
preferred label: rol van de maker @nl
top concept of: SSHOC Multilingual Metadata

εργαλείο ανάπτυξης
type: Concept
source: CLARIN
definition: Υποδεικνύει ένα συγκεκριμένο εργαλείο που μπορεί να χρησιμοποιηθεί για την ανάπτυξη του πόρου.
definition: Indicates a specific tool that may be used for the deployment of the resource. @en
definition: Indique un outil spécifique qui peut être utilisé pour le déploiement de la ressource. @fr
definition: Indica uno strumento specifico che può essere utilizzato per la distribuzione della risorsa. @it
definition: Geeft een specifiek hulpmiddel aan dat kan worden gebruikt voor de inzet van de bron. @nl
preferred label: deployment tool @en
preferred label: outil de déploiement @fr
preferred label: strumento di dispiegamento @it
preferred label: implementatie gereedschap @nl
top concept of: SSHOC Multilingual Metadata

ημερομηνία παραγωγής
type: Concept
source: CLARIN
definition: Υποδεικνύει την ημερομηνία παραγωγής σε περίπτωση που ένας πόρος προέρχεται από άλλον.
definition: Indicates the date of derivation in case that a resource was derived from another one. @en
definition: Indique la date de dérivation dans le cas où une ressource a été dérivée d'une autre. @fr
definition: Indica la data di derivazione nel caso in cui una risorsa sia derivata da un'altra. @it
definition: Geeft de datum van afleiding aan in het geval dat een bron is afgeleid van een andere. @nl
preferred label: derivation date @en
preferred label: date de dérivation @fr
preferred label: data di derivazione @it
preferred label: afleidingsdatum @nl
top concept of: SSHOC Multilingual Metadata

τρόπος παραγωγής
type: Concept
source: CLARIN
definition: Υποδεικνύει εάν η παραγωγή δημιουργήθηκε με το χέρι ή αυτόματα.
definition: Indicates whether the derivation was created manually or automatic. @en
definition: Indique si la dérivation a été créée manuellement ou automatiquement. @fr
definition: Indica se la derivazione è stata creata manualmente o automaticamente. @it
definition: Geeft aan of de afleiding handmatig of automatisch tot stand is gekomen. @nl
preferred label: derivation mode @en
preferred label: mode de dérivation @fr
preferred label: modalità di derivazione @it
preferred label: afleidingsmodus @nl
top concept of: SSHOC Multilingual Metadata

εργαλείο παραγωγής
type: Concept
source: CLARIN
definition: Υποδεικνύει το εργαλείο που χρησιμοποιήθηκε κατά τη διαδικασία παραγωγής.
definition: Indicates the tool that was used during the derivation process. @en
definition: Indique l'outil qui a été utilisé pendant le processus de dérivation. @fr
definition: Indica lo strumento che è stato utilizzato durante il processo di derivazione. @it
definition: Geeft aan welke tool is gebruikt tijdens het afleidingsproces. @nl
preferred label: derivation tool @en
preferred label: outil de dérivation @fr
preferred label: strumento di derivazione @it
preferred label: afleidingsinstrument @nl
top concept of: SSHOC Multilingual Metadata

τύπος παραγωγής
type: Concept
source: CLARIN
definition: Ένδειξη του τύπου παραγώγου.
definition: Indication of the type of derivation. @en
definition: Indication du type de dérivation. @fr
definition: Indicazione del tipo di derivazione. @it
definition: Aanduiding van het type afleiding. @nl
preferred label: derivation type @en
preferred label: type de dérivation @fr
preferred label: tipo di derivazione @it
preferred label: type afleiding @nl
top concept of: SSHOC Multilingual Metadata

ροή εργασιών παραγωγής
type: Concept
source: CLARIN
definition: Δείχνει τη διαδικασία ροής εργασίας στην οποία ενσωματώθηκε η διαδικασία παραγωγής.
definition: Indicates of the workflow process in which the derivation process was embedded. @en
definition: Indique le processus de workflow dans lequel le processus de dérivation a été intégré. @fr
definition: Indica il processo del flusso di lavoro in cui il processo di derivazione è stato incorporato. @it
definition: Aanduiding van het workflowproces waarin het afleidingsproces was ingebed. @nl
preferred label: derivation workflow @en
preferred label: processus de dérivation @fr
preferred label: flusso di lavoro di derivazione @it
preferred label: afleiding workflow @nl
top concept of: SSHOC Multilingual Metadata

περιγραφή
type: Concept
source: CLARIN
definition: Περιγραφή σε κείμενο των θεμάτων που υποδεικνύονται από το περιβάλλον. Το πεδίο της περιγραφής μπορεί να εμφανίζεται σε πολλές διαφορετικές θέσεις σε ένα συστατικό ή σε ένα προφίλ.
definition: A description in general prose text of the issues that are indicated by the context. The description field can occur at many different places in a component and profile. @en
definition: Une description en prose générale des problèmes indiqués par le contexte. Le champ de description peut se trouver à plusieurs endroits différents dans un composant et un profil. @fr
definition: Una descrizione in prosa generale dei problemi che sono indicati dal contesto. Il campo della descrizione può trovarsi in molti punti diversi in un componente e in un profilo. @it
definition: Een beschrijving in algemene prozatekst van de zaken die door de context worden aangegeven. Het beschrijvingsveld kan op veel verschillende plaatsen in een component en profiel voorkomen. @nl
preferred label: description @en
preferred label: descrizione @it
preferred label: beschrijving @nl
top concept of: SSHOC Multilingual Metadata

email
type: Concept
source: CLARIN
definition: Η διεύθυνση ηλεκτρονικού ταχυδρομείου ενός ατόμου ή ενός οργανισμού που εμπλέκεται στη δημιουργία, διαχείριση και πρόσβαση σε πόρους ή εργαλεία/υπηρεσίες.
definition: The email address of a person or an organization that is involved in creating, managing or accessing resources or tools/services. @en
definition: L'adresse électronique d'une personne ou d'une organisation qui participe à la création, à la gestion ou à l'accès aux ressources ou aux outils/services. @fr
definition: L'indirizzo e-mail di una persona o di un'organizzazione coinvolta nella creazione, gestione o accesso a risorse o strumenti/servizi. @it
definition: Het e-mailadres van een persoon of een organisatie die betrokken is bij de creatie, het beheer of de toegang tot bronnen of instrumenten/diensten. @nl
preferred label: e-mail @nl
top concept of: SSHOC Multilingual Metadata

χρηματοδότης
type: Concept
source: CLARIN
definition: Όνομα του χρηματοδότη του έργου.
definition: Name of the funder of the project. @en
definition: Nom du bailleur de fonds du projet. @fr
definition: Nome del finanziatore del progetto. @it
definition: Naam van de financier van het project. @nl
preferred label: funder @en
preferred label: bailleur de fonds @fr
preferred label: finanziatore @it
preferred label: financier @nl
top concept of: SSHOC Multilingual Metadata

γεωγραφικές συντεταγμένες
type: Concept
source: CLARIN
definition: Οι γεωγραφικές συντεταγμένες που προσδιορίζουν τη θέση δημιουργίας του πόρου που καθορίζεται ως ζεύγος σύμφωνα με τα πρότυπα.
definition: The geographical coordinates identifying the location of the creation of the resource specified as a pair according to the norms. @en
definition: Les coordonnées géographiques identifiant l'emplacement de la création de la ressource spécifiée comme une paire selon les normes @fr
definition: Le coordinate geografiche che identificano il luogo di creazione della risorsa specificata come coppia secondo le norme. @it
definition: De geografische coördinaten die de plaats van de creatie van de bron identificeren, gespecificeerd als een paar volgens de normen. @nl
preferred label: geographical coordinates @en
preferred label: coordonnées géographiques @fr
preferred label: coordinate geografiche @it
preferred label: geografische coördinaten @nl
top concept of: SSHOC Multilingual Metadata

ημερομηνία συγκομιδής
type: Concept
source: CLARIN
definition: Ημερομηνία κατά την οποία ελήφθη αντίγραφο του πρωτότυπου πόρου.
definition: Date when a copy was taken of the original resource. @en
definition: Date à laquelle une copie a été faite de la ressource originale. @fr
definition: Data in cui è stata fatta una copia della risorsa originale. @it
definition: Datum waarop een kopie werd gemaakt van de originele bron. @nl
preferred label: harvesting date @en
preferred label: date de récolte @fr
preferred label: data di raccolta @it
preferred label: oogstdatum @nl
top concept of: SSHOC Multilingual Metadata

συμφωνία μεταξύ των επισημειωτών
type: Concept
source: CLARIN
definition: Ένδειξη συμφωνίας μεταξύ των επισημειωτών, εφόσον εφαρμόστηκαν οι κατάλληλες μέθοδοι.
definition: An indication of the inter-annotator agreement if appropriate methods where applied. @en
definition: Une indication de l'accord entre les annotateurs si des méthodes appropriées ont été appliquées. @fr
definition: Un'indicazione dell'accordo inter-annotatore se sono stati applicati metodi appropriati. @it
definition: Een indicatie van de inter-annotator overeenkomst indien geschikte methoden werden toegepast. @nl
preferred label: interannotator agreement @en
preferred label: accord inter-annotateur @fr
preferred label: accordo tra annotatori @it
preferred label: interannotator overeenkomst @nl
top concept of: SSHOC Multilingual Metadata

τελευταία ενημέρωση
type: Concept
source: CLARIN
definition: Η ημερομηνία της τελευταίας ενημέρωσης.
definition: The date of the last update. @en
definition: La date de la dernière mise à jour. @fr
definition: La data dell'ultimo aggiornamento. @it
definition: De datum van de laatste bijwerking. @nl
preferred label: last update @en
preferred label: dernière mise à jour @fr
preferred label: ultimo aggiornamento @it
preferred label: laatste update @nl
top concept of: SSHOC Multilingual Metadata

γλωσσικό αντικείμενο
type: Concept
source: CLARIN
definition: Παρέχει ένα ελεγχόμενο λεξιλόγιο για την περιγραφή του αντικειμένου ενός πόρου ως σχετικού με ένα συγκεκριμένο υποπεδίο της γλωσσολογίας.
definition: Provides a controlled vocabulary for describing the subject matter of a resource as relevant to a particular subfield of linguistics. @en
definition: Fournit un vocabulaire contrôlé pour décrire le sujet d'une ressource comme étant pertinent pour un sous-domaine particulier de la linguistique. @fr
definition: Fornisce un vocabolario controllato per descrivere l'argomento di una risorsa come rilevante per un particolare sottocampo della linguistica. @it
definition: Een gecontroleerd vocabulaire om het onderwerp van een bron te beschrijven als relevant voor een bepaald deelgebied van de taalkunde. @nl
preferred label: linguistic subject @en
preferred label: sujet linguistique @fr
preferred label: soggetto linguistico @it
preferred label: linguïstisch onderwerp @nl
top concept of: SSHOC Multilingual Metadata

διεύθυνση τοποθεσίας
type: Concept
source: CLARIN
definition: Η διεύθυνση στην οποία δημιουργήθηκε ή από όπου προήλθε ο πόρος.
definition: The address where the resource was created or originated. @en
definition: L'adresse où la ressource a été créée ou provient. @fr
definition: L'indirizzo dove la risorsa è stata creata o ha avuto origine. @it
definition: Het adres waar de bron werd gecreëerd of vandaan komt. @nl
preferred label: location address @en
preferred label: adresse du lieu @fr
preferred label: indirizzo dell'ubicazione @it
preferred label: locatie adres @nl
top concept of: SSHOC Multilingual Metadata

τοποθεσία ηπείρου
type: Concept
source: CLARIN
definition: Η ήπειρος από όπου δημιουργήθηκε ή προήλθε ο πόρος.
definition: The continent of where the resource was created or originated. @en
definition: Le continent où la ressource a été créée ou est originaire. @fr
definition: Il continente in cui la risorsa è stata creata o ha avuto origine. @it
definition: Het continent waar de bron werd aangemaakt of vandaan komt. @nl
preferred label: location continent @en
preferred label: emplacement continent @fr
preferred label: posizione continente @it
preferred label: locatie continent @nl
top concept of: SSHOC Multilingual Metadata

τοποθεσία χώρας
type: Concept
source: CLARIN
definition: Η χώρα στην οποία δημιουργήθηκε ή από την οποία προήλθε ο πόρος.
definition: The country where the resource was created or originated. @en
definition: Le pays où la ressource a été créée ou est originaire. @fr
definition: Il paese in cui la risorsa è stata creata o ha avuto origine. @it
definition: Het land waar de bron werd aangemaakt of vandaan komt. @nl
preferred label: location country @en
preferred label: pays de localisation @fr
preferred label: posizione paese @it
preferred label: locatie land @nl
top concept of: SSHOC Multilingual Metadata

τοποθεσία περιοχής
type: Concept
source: CLARIN
definition: Η περιοχή ή υποπεριοχή όπου δημιουργήθηκε ή προήλθε ο πόρος.
definition: The region or sub-region where the resource was created or originated. @en
definition: La région ou sous-région où la ressource a été créée ou est originaire. @fr
definition: La regione o sottoregione dove la risorsa è stata creata o ha avuto origine. @it
definition: De regio of subregio waar de bron werd aangemaakt of vandaan komt. @nl
preferred label: location region @en
preferred label: région de localisation @fr
preferred label: posizione regione @it
preferred label: locatie regio @nl
top concept of: SSHOC Multilingual Metadata

αρχική πηγή
type: Concept
source: CLARIN
definition: Αναφέρονται οι αρχικοί πόροι που αποτέλεσαν τη βάση της διαδικασίας δημιουργίας/παραγωγής.
definition: Indicates the original resources that were at the base of the creation/derivation process. @en
definition: Indique les ressources originales qui étaient à la base du processus de création/dérivation. @fr
definition: Indica le risorse originali che erano alla base del processo di creazione/derivazione. @it
definition: Vermelding van de oorspronkelijke bronnen die aan de basis lagen van het creatie/derivatieproces. @nl
preferred label: original source @en
preferred label: source originale @fr
preferred label: fonte originale @it
preferred label: oorspronkelijke bron @nl
top concept of: SSHOC Multilingual Metadata

αναγνωριστικό έργου
type: Concept
source: CLARIN
definition: Μοναδικό αναγνωριστικό που προσδιορίζει το έργο.
definition: A unique identifier identifying the project. @en
definition: Un identifiant unique identifiant le projet. @fr
definition: Un identificatore unico che identifica il progetto. @it
definition: Een unieke identificator die het project identificeert. @nl
preferred label: project id @en
preferred label: identifiant du projet @fr
preferred label: id del progetto @it
preferred label: project-id @nl
top concept of: SSHOC Multilingual Metadata

όνομα έργου
type: Concept
source: CLARIN
definition: Σύντομο όνομα ή συντομογραφία του έργου που οδήγησε στη δημιουργία του πόρου ή του εργαλείου/υπηρεσίας.
definition: A short name or abbreviation of the project that led to the creation of the resource or tool/service. @en
definition: Un nom court ou une abréviation du projet qui a conduit à la création de la ressource ou de l'outil/service. @fr
definition: Un breve nome o abbreviazione del progetto che ha portato alla creazione della risorsa o dello strumento/servizio. @it
definition: Een korte naam of afkorting van het project dat leidde tot de creatie van de bron of het hulpmiddel/de dienst. @nl
preferred label: project name @en
preferred label: nom du projet @fr
preferred label: nome del progetto @it
preferred label: naam van het project @nl
top concept of: SSHOC Multilingual Metadata

τίτλος έργου
type: Concept
source: CLARIN
definition: Ο πλήρης τίτλος του έργου που οδήγησε στη δημιουργία του πόρου ή του εργαλείου/υπηρεσίας.
definition: The full title of the project that led to the creation of the resource or tool/service. @en
definition: Le titre complet du projet qui a conduit à la création de la ressource ou de l'outil/service. @fr
definition: Il titolo completo del progetto che ha portato alla creazione della risorsa o dello strumento/servizio. @it
definition: De volledige titel van het project dat geleid heeft tot de creatie van de bron of het hulpmiddel/de dienst. @nl
preferred label: project title @en
preferred label: titre du projet @fr
preferred label: titolo del progetto @it
preferred label: projecttitel @nl
top concept of: SSHOC Multilingual Metadata

ημερομηνία δημοσίευσης
type: Concept
source: CLARIN
definition: Η ημερομηνία κατά την οποία ο πόρος ή το εργαλείο/υπηρεσία δημοσιεύθηκε, δηλαδή ανακοινώθηκε στο κοινό.
definition: The date at which the resource or tool/service was published, i.e. announced to the public. @en
definition: La date à laquelle la ressource ou l'outil/service a été publié, c'est-à-dire annoncé au public. @fr
definition: La data in cui la risorsa o lo strumento/servizio è stato pubblicato, cioè annunciato al pubblico. @it
definition: De datum waarop de bron of het hulpmiddel/de dienst werd gepubliceerd, d.w.z. aan het publiek werd bekendgemaakt. @nl
preferred label: publication date @en
preferred label: date de publication @fr
preferred label: data di pubblicazione @it
preferred label: publicatiedatum @nl
top concept of: SSHOC Multilingual Metadata

έτος έναρξης
type: Concept
source: CLARIN
definition: Το έτος κατά το οποίο ξεκίνησε η διαδικασία δημιουργίας.
definition: The year in which the creation process was started. @en
definition: L'année au cours de laquelle le processus de création a été lancé. @fr
definition: L'anno in cui è iniziato il processo di creazione. @it
definition: Het jaar waarin het creatieproces werd gestart. @nl
preferred label: start year @en
preferred label: année de début @fr
preferred label: anno di inizio @it
preferred label: startjaar @nl
top concept of: SSHOC Multilingual Metadata

συχνότητα ενημέρωσης
type: Concept
source: CLARIN
definition: Η συχνότητα με την οποία ενημερώνεται ο πόρος ή το εργαλείο/υπηρεσία.
definition: The Frequency with which the resource or the tool/service is updated. @en
definition: La fréquence à laquelle la ressource ou l'outil/service est mis à jour. @fr
definition: La frequenza con cui la risorsa o lo strumento/servizio viene aggiornato. @it
definition: De frequentie waarmee de bron of het hulpmiddel/de dienst wordt bijgewerkt. @nl
preferred label: update frequency @en
preferred label: fréquence de mise à jour @fr
preferred label: frequenza di aggiornamento @it
preferred label: update frequentie @nl
top concept of: SSHOC Multilingual Metadata

ημερομηνία δημιουργίας μεταδεδομένων
type: Concept
source: CLARIN
definition: Η ημερομηνία δημιουργίας αυτής της περιγραφής μεταδεδομένων.
definition: The date of creation of this metadata description. @en
definition: La date de création de cette description de métadonnées. @fr
definition: La data di creazione di questa descrizione di metadati. @it
definition: De datum van creatie van deze metadata-beschrijving. @nl
preferred label: metadata creation date @en
preferred label: date de création des métadonnées @fr
preferred label: data di creazione dei metadati @it
preferred label: datum aanmaak metadata @nl
top concept of: SSHOC Multilingual Metadata

δημιουργός μεταδεδομένων
type: Concept
source: CLARIN
definition: Το όνομα (ή τα ονόματα) του προσώπου (ή των προσώπων) που δημιούργησε (ή δημιούργησαν) αυτή την περιγραφή μεταδεδομένων.
definition: The name(s) of the person(s) that created this metadata description. @en
definition: Le nom de la (des) personne(s) qui a (ont) créé cette description de métadonnées. @fr
definition: Il nome della persona o delle persone che hanno creato questa descrizione dei metadati. @it
definition: De naam (namen) van de persoon (personen) die deze metagegevensbeschrijving heeft (hebben) gemaakt. @nl
preferred label: metadata creator @en
preferred label: créateur de métadonnées @fr
preferred label: creatore di metadati @it
preferred label: maker van metadata @nl
top concept of: SSHOC Multilingual Metadata

γλώσσα μεταδεδομένων
type: Concept
source: CLARIN
definition: Ένα αναγνωριστικό της γλώσσας στην οποία γράφτηκε η περιγραφή μεταδεδομένων.
definition: An identifier of the language in which the metadata description was written. @en
definition: Un identifiant de la langue dans laquelle la description des métadonnées a été écrite. @fr
definition: Un identificatore della lingua in cui la descrizione dei metadati è stata scritta. @it
definition: Een identifier van de taal waarin de metagegevensbeschrijving werd geschreven. @nl
preferred label: metadata language @en
preferred label: langage de métadonnées @fr
preferred label: linguaggio dei metadati @it
preferred label: taal metagegevens @nl
top concept of: SSHOC Multilingual Metadata

όνομα πόρου
type: Concept
source: CLARIN
definition: Ένα σύντομο όνομα για τον προσδιορισμό του γλωσσικού πόρου.
definition: A short name to identify the language resource. @en
definition: Un nom court pour identifier la ressource linguistique. @fr
definition: Un nome breve per identificare la risorsa linguistica. @it
definition: Een korte naam om de taalbron te identificeren. @nl
preferred label: resource name @en
preferred label: nom de la ressource @fr
preferred label: nome della risorsa @it
preferred label: naam van de bron @nl
top concept of: SSHOC Multilingual Metadata

τίτλος πόρου
type: Concept
source: CLARIN
definition: Ο τίτλος είναι ο πλήρης τίτλος του πόρου χωρίς συντομογραφίες.
definition: The title is the complete title of the resource without any abbreviations. @en
definition: Le titre est le titre complet de la ressource sans aucune abréviation. @fr
definition: Il titolo è il titolo completo della risorsa senza abbreviazioni. @it
definition: De titel is de volledige titel van de bron zonder afkortingen. @nl
preferred label: resource title @en
preferred label: titre de la ressource @fr
preferred label: titolo della risorsa @it
preferred label: titel van de bron @nl
top concept of: SSHOC Multilingual Metadata

url
type: Concept
source: CLARIN
definition: Μια διεύθυνση URL που παραπέμπει σε έναν άλλο πόρο που μπορεί να χρησιμοποιηθεί σε διάφορα πλαίσια.
definition: A URL referring to another resource that can be used in various contexts. @en
definition: Une URL qui renvoie à une autre ressource et qui peut être utilisée dans divers contextes. @fr
definition: Un URL che si riferisce ad un'altra risorsa che può essere usata in vari contesti. @it
definition: Een URL die verwijst naar een andere bron die in verschillende contexten kan worden gebruikt. @nl
top concept of: SSHOC Multilingual Metadata

έκδοση
type: Concept
source: CLARIN
definition: Αριθμός που προσδιορίζει την έκδοση μιας περιγραφής μεταδεδομένων, ενός πόρου ή ενός εργαλείου/υπηρεσίας ιστού.
definition: A number that identifies the version of a metadata description, a resource or a tool/web service. @en
definition: Un numéro qui identifie la version d'une description de métadonnées, d'une ressource ou d'un outil/service web. @fr
definition: Un numero che identifica la versione di una descrizione di metadati, una risorsa o uno strumento/servizio web. @it
definition: Een getal dat de versie van een metadatabeschrijving, een bron of een instrument/webdienst aanduidt. @nl
preferred label: version @en
preferred label: versione @it
preferred label: versie @nl
top concept of: SSHOC Multilingual Metadata

σήμανση ανωνυμοποίησης
type: Concept
source: CLARIN
definition: Δείχνει αν το όνομα και το πλήρες όνομα του ατόμου που συμμετείχε στη συνεδρία, το πείραμα ή παρόμοια διαδικασία δημιουργίας πόρου αντικαταστάθηκε ή όχι από ψευδώνυμα για να καταστεί ανώνυμο. (boolean)
definition: Indicates whether or not the name and full name of the person participating in the session, experiment or similar resource creation process are replaced by pseudo names to make him/her anonymous. (boolean) @en
definition: Indique si le nom et le prénom de la personne participant à la session, à l'expérience ou au processus de création de ressources similaires sont remplacés ou non par des pseudonymes pour la rendre anonyme. (booléen) @fr
definition: Indica se il nome e il nome completo della persona che partecipa alla sessione, all'esperimento o al processo di creazione di una risorsa simile sono sostituiti o meno da pseudonimi per renderlo anonimo. (booleano) @it
definition: Geeft aan of de naam en de volledige naam van de persoon die deelneemt aan de sessie, het experiment of een soortgelijk proces voor het aanmaken van bronnen al dan niet vervangen zijn door pseudonamen om hem/haar anoniem te maken. (booleaans) @nl
preferred label: anonymization flag @en
preferred label: indicateur d'anonymisation @fr
preferred label: indicatore di anonimizzazione @it
preferred label: anonimiseringsvlag @nl
top concept of: SSHOC Multilingual Metadata

τύπος σχέσης
type: Concept
source: CLARIN
definition: Τυπική προδιαγραφή μιας σχέσης αυτού του πόρου ή εργαλείου/υπηρεσίας με έναν άλλο πόρο ή εργαλείο/υπηρεσία.
definition: Formal specification of a relation of this resource or tool/service with another resource or tool/service. @en
definition: Spécification formelle d'une relation de cette ressource ou outil/service avec une autre ressource ou outil/service. @fr
definition: Specificazione formale di una relazione di questa risorsa o strumento/servizio con un'altra risorsa o strumento/servizio. @it
definition: Formele specificatie van een relatie van deze bron of werktuig/dienst met een andere bron of werktuig/dienst. @nl
preferred label: relation type @en
preferred label: type de relation @fr
preferred label: tipo di relazione @it
preferred label: relatietype @nl
top concept of: SSHOC Multilingual Metadata

ηλικία συμμετέχοντος
type: Concept
source: CLARIN
definition: Η ηλικία του ατόμου που συμμετέχει στο περιεχόμενο του πόρου.
definition: The age of the person participating in the content of the resource. @en
definition: L'âge de la personne qui participe au contenu de la ressource. @fr
definition: L'età della persona che partecipa al contenuto della risorsa. @it
definition: De leeftijd van de persoon die meewerkt aan de inhoud van de bron. @nl
preferred label: participant age @en
preferred label: âge du participant @fr
preferred label: età del partecipante @it
preferred label: leeftijd deelnemer @nl
top concept of: SSHOC Multilingual Metadata

ημερομηνία γέννησης του συμμετέχοντα
type: Concept
source: CLARIN
definition: Η ημερομηνία γέννησης του ατόμου που συμμετέχει στο περιεχόμενο του πόρου.
definition: The date of birth of the person participating in the content of the resource. @en
definition: La date de naissance de la personne qui participe au contenu de la ressource. @fr
definition: La data di nascita della persona che partecipa al contenuto della risorsa. @it
definition: De geboortedatum van de persoon die deelneemt aan de inhoud van de bron. @nl
preferred label: participant birthdate @en
preferred label: date de naissance du participant @fr
preferred label: data di nascita del partecipante @it
preferred label: geboortedatum deelnemer @nl
top concept of: SSHOC Multilingual Metadata

κωδικός συμμετέχοντα
type: Concept
source: CLARIN
definition: Σύντομος μοναδικός κωδικός για την ταυτοποίηση του ατόμου που συμμετέχει στο περιεχόμενο του πόρου.
definition: Short unique code to identify the person participating in the content of the resource. @en
definition: Code unique court permettant d'identifier la personne participant au contenu de la ressource. @fr
definition: Breve codice unico per identificare la persona che partecipa al contenuto della risorsa. @it
definition: Korte unieke code ter identificatie van de persoon die deelneemt aan de inhoud van de bron. @nl
preferred label: participant code @en
preferred label: code participant @fr
preferred label: codice partecipante @it
preferred label: deelnemerscode @nl
top concept of: SSHOC Multilingual Metadata

κυρίαρχη γλώσσα του συμμετέχοντα
type: Concept
source: CLARIN
definition: Καθορίζει την προτιμώμενη γλώσσα ενός συμμετέχοντα.
definition: Specifies the preferred language of a participant. @en
definition: Spécifie la langue préférée d'un participant. @fr
definition: Specifica la lingua preferita di un partecipante. @it
definition: Specificeert de voorkeurstaal van een deelnemer. @nl
preferred label: participant dominant language @en
preferred label: langue dominante du participant @fr
preferred label: lingua dominante del partecipante @it
preferred label: dominante taal deelnemer @nl
top concept of: SSHOC Multilingual Metadata

εκπαίδευση του συμμετέχοντα
type: Concept
source: CLARIN
definition: Η εκπαίδευση του ατόμου που συμμετέχει στο περιεχόμενο του πόρου.
definition: The education of the person participating in the content of the resource. @en
definition: La formation de la personne qui participe au contenu de la ressource. @fr
definition: L'educazione della persona che partecipa al contenuto della risorsa. @it
definition: De opleiding van de persoon die aan de inhoud van de bron deelneemt. @nl
preferred label: participant education @en
preferred label: éducation des participants @fr
preferred label: educazione del partecipante @it
preferred label: opleiding deelnemer @nl
top concept of: SSHOC Multilingual Metadata

εθνοτική ομάδα του συμμετέχοντος
type: Concept
source: CLARIN
definition: Η εθνοτική ομάδα του ατόμου που συμμετέχει στο περιεχόμενο ενός πόρου.
definition: The ethnic group of the person participating in the content of the resource. @en
definition: Le groupe ethnique de la personne qui participe au contenu de la ressource. @fr
definition: Il gruppo etnico della persona che partecipa al contenuto della risorsa. @it
definition: De etnische groep van de persoon die deelneemt aan de inhoud van de bron. @nl
preferred label: participant ethnic group @en
preferred label: groupe ethnique du participant @fr
preferred label: gruppo etnico del partecipante @it
preferred label: etnische groep deelnemer @nl
top concept of: SSHOC Multilingual Metadata

ονοματεπώνυμο συμμετέχοντος
type: Concept
source: CLARIN
definition: Το πλήρες όνομα του ατόμου που συμμετέχει στο περιεχόμενο του πόρου.
definition: The full name of the person participating in the content of the resource. @en
definition: Le nom complet de la personne qui participe au contenu de la ressource. @fr
definition: Il nome completo della persona che partecipa al contenuto della risorsa. @it
definition: De volledige naam van de persoon die deelneemt aan de inhoud van de bron. @nl
preferred label: participant full name @en
preferred label: nom complet du participant @fr
preferred label: nome completo del partecipante @it
preferred label: volledige naam deelnemer @nl
top concept of: SSHOC Multilingual Metadata

όνομα συμμετέχοντος
type: Concept
source: CLARIN
definition: Το όνομα του ατόμου που συμμετέχει στο περιεχόμενο της καταγραφής, όπως χρησιμοποιείται από άλλους στη μεταγραφή.
definition: The name of the person participating in the content of the recording as it is used by others in the transcription. @en
definition: Le nom de la personne participant au contenu de l'enregistrement tel qu'il est utilisé par les autres dans la transcription. @fr
definition: Il nome della persona che partecipa al contenuto della registrazione come viene usato da altri nella trascrizione. @it
definition: De naam van de persoon die aan de inhoud van de bron meewerkt zoals die door anderen in de transcriptie wordt gebruikt. @nl
preferred label: participant name @en
preferred label: nom du participant @fr
preferred label: nome del partecipante @it
preferred label: naam deelnemer @nl
top concept of: SSHOC Multilingual Metadata

επάγγελμα του συμμετέχοντος
type: Concept
source: CLARIN
definition: Το επάγγελμα του ατόμου που συμμετέχει στο περιεχόμενο του πόρου.
definition: The profession of the person participating in the content of the resource. @en
definition: La profession de la personne qui participe au contenu de la ressource. @fr
definition: La professione della persona che partecipa al contenuto della risorsa. @it
definition: Het beroep van de persoon die aan de inhoud van de bron deelneemt. @nl
preferred label: participant profession @en
preferred label: profession du participant @fr
preferred label: professione del partecipante @it
preferred label: beroep deelnemer @nl
top concept of: SSHOC Multilingual Metadata

ρόλος του συμμετέχοντος
type: Concept
source: CLARIN
definition: Ο λειτουργικός ρόλος του ατόμου που συμμετέχει στο περιεχόμενο του πόρου.
definition: The functional role of the person participating in the content of the resource. @en
definition: Le rôle fonctionnel de la personne qui participe au contenu de la ressource. @fr
definition: Il ruolo funzionale della persona che partecipa al contenuto della risorsa. @it
definition: De functionele rol van de persoon die aan de inhoud van de bron deelneemt. @nl
preferred label: participant role @en
preferred label: rôle du participant @fr
preferred label: ruolo del partecipante @it
preferred label: rol deelnemer @nl
top concept of: SSHOC Multilingual Metadata

φύλο συμμετέχοντος
type: Concept
source: CLARIN
definition: Το φύλο του ατόμου που συμμετέχει στο περιεχόμενο του πόρου.
definition: The sex of the person participating in the content of the resource. @en
definition: Le sexe de la personne qui participe au contenu de la ressource. @fr
definition: Il sesso della persona che partecipa al contenuto della risorsa. @it
definition: Het geslacht van de persoon die aan de inhoud van de bron deelneemt. @nl
preferred label: participant sex @en
preferred label: sexe du participant @fr
preferred label: sesso del partecipante @it
preferred label: geslacht deelnemer @nl
top concept of: SSHOC Multilingual Metadata

κοινωνικός οικογενειακός ρόλος
type: Concept
source: CLARIN
definition: Ο κοινωνικός ή οικογενειακός ρόλος του ατόμου που συμμετέχει στο περιεχόμενο του πόρου.
definition: The social or family role of the person participating in the content of the resource. @en
definition: Le rôle social ou familial de la personne qui participe au contenu de la ressource. @fr
definition: Il ruolo sociale o familiare della persona che partecipa al contenuto della risorsa. @it
definition: De sociale of familiale rol van de persoon die deelneemt aan de inhoud van de bron. @nl
preferred label: social family role @en
preferred label: rôle social familial @fr
preferred label: ruolo sociale della famiglia @it
preferred label: sociale familierol @nl
top concept of: SSHOC Multilingual Metadata

μορφότυπο επισημείωσης
type: Concept
source: PWittenburg
definition: Προσδιορισμός του μορφότυπου επισημείωσης που χρησιμοποιείται, δεδομένου ότι συχνά ο τύπος MIME δεν επαρκεί για τη μηχανική επεξεργασία.
definition: Specification of the annotation format that is used since often the mime type will not be sufficient for machine processing. @en
definition: Spécification du format d'annotation utilisé, car souvent le type mime ne sera pas suffisant pour le traitement automatique. @fr
definition: Specifica del formato di annotazione che viene utilizzato, poiché spesso il tipo mime non sarà sufficiente per l'elaborazione automatica. @it
definition: Specificatie van het annotatieformaat dat wordt gebruikt, aangezien het mime-type vaak niet toereikend zal zijn voor machinale verwerking. @nl
preferred label: annotation format @en
preferred label: format d'annotation @fr
preferred label: formato di annotazione @it
preferred label: annotatieformaat @nl
top concept of: SSHOC Multilingual Metadata

μέθοδος καταγραφής
type: Concept
source: CLARIN
definition: Ένδειξη της μεθόδου καταγραφής/ψηφιοποίησης που χρησιμοποιήθηκε κατά τη δημιουργία της ψηφιακής έκδοσης.
definition: Indication of the capturing/digitization method that was used when creating the digital version. @en
definition: Indication de la méthode de capture/numérisation qui a été utilisée lors de la création de la version numérique. @fr
definition: Indicazione del metodo di cattura/digitalizzazione che è stato usato per creare la versione digitale. @it
definition: Aanduiding van de vastleggings-/digitaliseringsmethode die is gebruikt bij het maken van de digitale versie. @nl
preferred label: capture method @en
preferred label: méthode de capture @fr
preferred label: metodo di cattura @it
preferred label: opnamemethode @nl
top concept of: SSHOC Multilingual Metadata

κωδικοποίηση χαρακτήρων
type: Concept
source: CLARIN
definition: Το όνομα της κωδικοποίησης χαρακτήρων που χρησιμοποιείται στον πόρο ή γίνεται αποδεκτή από το εργαλείο/την υπηρεσία.
definition: Name of the character encoding used in the resource or accepted by the tool/service. @en
definition: Nom de l'encodage de caractères utilisé dans la ressource ou accepté par l'outil/service. @fr
definition: Nome della codifica dei caratteri usata nella risorsa o accettata dallo strumento/servizio. @it
definition: Naam van de tekencodering die in de bron wordt gebruikt of door de tool/dienst wordt aanvaard. @nl
preferred label: character encoding @en
preferred label: codage des caractères @fr
preferred label: codifica dei caratteri @it
preferred label: tekencodering @nl
top concept of: SSHOC Multilingual Metadata

σύνολο χαρακτήρων
type: Concept
source: CLARIN
definition: Ο κατάλογος χαρακτήρων που χρησιμοποιούνται στον πόρο. Ένα σύνολο χαρακτήρων (μη κωδικοποιημένων χαρακτήρων) ή κωδικοποιημένων χαρακτήρων όπως ορίζονται στο RFC 2050.
definition: The repertoire of characters used in the resource. A range of characters (non-coded character set) or a coded character set as defined in RFC 2050. @en
definition: Le répertoire des caractères utilisés dans la ressource. Une gamme de caractères (jeu de caractères non codés) ou un jeu de caractères codés tel que défini dans la RFC 2050. @fr
definition: Il repertorio di caratteri usato nella risorsa. Una gamma di caratteri (set di caratteri non codificati) o un set di caratteri codificati come definito in RFC 2050. @it
definition: Het repertoire van tekens dat in de bron wordt gebruikt. Een reeks tekens (niet-gecodeerde tekenset) of een gecodeerde tekenset zoals gedefinieerd in RFC 2050. @nl
preferred label: character set @en
preferred label: jeu de caractères @fr
preferred label: set di caratteri @it
preferred label: tekenset @nl
top concept of: SSHOC Multilingual Metadata

συνθήκη
type: Concept
source: CLARIN
definition: Περιγραφή των τεχνικών συνθηκών υπό τις οποίες καταγράφηκε ο πόρος.
definition: Description of the technical conditions under which the resource was recorded. @en
definition: Description des conditions techniques dans lesquelles la ressource a été enregistrée. @fr
definition: Descrizione delle condizioni tecniche in cui la risorsa è stata registrata. @it
definition: Beschrijving van de technische omstandigheden waaronder de bron is opgenomen. @nl
preferred label: condition @en
preferred label: condizione @it
preferred label: voorwaarde @nl
top concept of: SSHOC Multilingual Metadata

διάρκεια
type: Concept
source: CLARIN
definition: Προσδιορισμός της διάρκειας μιας καταγραφής.
definition: Specification of the duration of a recording. @en
definition: Spécification de la durée d'un enregistrement. @fr
definition: Specificazione della durata di una registrazione. @it
definition: Specificatie van de duur van een opname. @nl
preferred label: duration @en
preferred label: durée @fr
preferred label: durata @it
preferred label: looptijd @nl
top concept of: SSHOC Multilingual Metadata

περιβάλλον
type: Concept
source: CLARIN
definition: Περιγραφή των περιβαλλοντικών συνθηκών υπό τις οποίες δημιουργήθηκε η καταγραφή.
definition: Description of the environmental conditions under which the recording was created. @en
definition: Description des conditions environnementales dans lesquelles l'enregistrement a été créé. @fr
definition: Descrizione delle condizioni ambientali in cui è stata creata la registrazione. @it
definition: Beschrijving van de omgevingsomstandigheden waaronder de opname is gemaakt. @nl
preferred label: environment @en
preferred label: environnement @fr
preferred label: ambiente @it
preferred label: omgeving @nl
top concept of: SSHOC Multilingual Metadata

τοποθεσία εκτέλεσης
type: Concept
source: CLARIN
definition: Προσδιορισμός της τοποθεσίας όπου εκτελείται το εργαλείο/υπηρεσία.
definition: Identification of the location where the tool/service is being executed. @en
definition: Identification de l'endroit où l'outil/service est exécuté. @fr
definition: Identificazione del luogo in cui lo strumento/servizio viene eseguito. @it
definition: Identificatie van de locatie waar de tool/dienst wordt uitgevoerd. @nl
preferred label: execution location @en
preferred label: lieu d'exécution @fr
preferred label: luogo di esecuzione @it
preferred label: uitvoeringslocatie @nl
top concept of: SSHOC Multilingual Metadata

τύπος μέσου
type: Concept
source: CLARIN
definition: Προσδιορισμός του τύπου μέσων του πόρου ή των τύπων μέσων για τους οποίους είναι κατάλληλο το εργαλείο ή η υπηρεσία.
definition: Specification of the media type of the resource or the media types for which the tool or service is suitable. @en
definition: Spécification du type de média de la ressource ou des types de média pour lesquels l'outil ou le service est adapté. @fr
definition: Specificazione del tipo di media della risorsa o dei tipi di media per i quali lo strumento o il servizio è adatto. @it
definition: Specificatie van het mediatype van de bron of de mediatypes waarvoor het hulpmiddel of de dienst geschikt is. @nl
preferred label: media type @en
preferred label: type de média @fr
preferred label: tipo di media @it
preferred label: mediatype @nl
top concept of: SSHOC Multilingual Metadata

τύπος MIME
type: Concept
source: CLARIN
definition: Προσδιορισμός του τύπου MIME ενός πόρου, ο οποίος διευκρινίζει το μορφότυπο στο οποίο βρίσκεται ένας πόρος ή τον τύπο MIME που δέχεται το εργαλείο ή η υπηρεσία.
definition: Specification of the mime-type of the resource which is a formalized specifier for the format included or a mime-type that the tool/service accepts. @en
definition: Spécification du type mime de la ressource qui est un spécificateur formalisé pour le format inclus ou un type mime que l'outil/service accepte. @fr
definition: Specifica del tipo MIME della risorsa che è uno specificatore formalizzato per il formato incluso o un tipo MIME che lo strumento/servizio accetta. @it
definition: Specificatie van het mime-type van de bron, d.w.z. een geformaliseerde specificatie van het opgenomen formaat of een mime-type dat door de tool/dienst wordt aanvaard. @nl
preferred label: mime type @en
preferred label: type MIME @fr
preferred label: tipo MIME @it
top concept of: SSHOC Multilingual Metadata

λειτουργικό σύστημα
type: Concept
source: CLARIN
definition: Προσδιορισμός του λειτουργικού συστήματος και των ακριβών προδιαγραφών του που απαιτούνται για την εκτέλεση του εργαλείου/υπηρεσίας.
definition: Identification of the operating system and its exact specification that is required to execute the tool/service. @en
definition: Identification du système d'exploitation et de sa spécification exacte qui est nécessaire pour exécuter l'outil/service. @fr
definition: Identificazione del sistema operativo e della sua specifica esatta che è richiesta per eseguire lo strumento/servizio. @it
definition: Identificatie van het besturingssysteem en de exacte specificatie ervan die nodig is om het gereedschap/de dienst uit te voeren. @nl
preferred label: operating system @en
preferred label: système d'exploitation @fr
preferred label: sistema operativo @it
preferred label: besturingssysteem @nl
top concept of: SSHOC Multilingual Metadata

μόνιμο αναγνωριστικό
type: Concept
source: CLARIN
definition: Προσδιορισμός ενός μόνιμου αναγνωριστικού που αναφέρεται στον πόρο ή το εργαλείο/την υπηρεσία που περιγράφουν οι πληροφορίες μεταδεδομένων.
definition: Specification of a persistent identifier that refers to the resource or tool/service this metadata information describes. @en
definition: Spécification d'un identifiant persistant qui fait référence à la ressource ou à l'outil/service que ces informations de métadonnées décrivent. @fr
definition: Specificazione di un identificatore persistente che si riferisce alla risorsa o allo strumento/servizio che questa informazione di metadati descrive. @it
definition: Specificatie van een persistente identifier die verwijst naar de bron of het gereedschap/de dienst die deze metadata-informatie beschrijft. @nl
preferred label: persistent identifier @en
preferred label: identifiant pérenne @fr
preferred label: identificatore persistente @it
preferred label: permanente identificatiecode @nl
top concept of: SSHOC Multilingual Metadata

ποιότητα
type: Concept
source: CLARIN
definition: Ένδειξη της ποιότητας του αρχείου πολυμέσων ή της υπηρεσίας (1=χαμηλή..5=υψηλή)
definition: An indication of the quality of the media file or service (1=low..5=high) @en
definition: Une indication de la qualité du fichier multimédia ou du service (1=bas..5=haut) @fr
definition: Un'indicazione della qualità del file multimediale o del servizio (1=bassa..5=alta) @it
definition: Een indicatie van de kwaliteit van het mediabestand of de mediadienst (1=laag..5=hoog) @nl
preferred label: quality @en
preferred label: qualité @fr
preferred label: qualità @it
preferred label: kwaliteit @nl
top concept of: SSHOC Multilingual Metadata

ανάλυση
type: Concept
source: CLARIN
definition: Προδιαγραφή της χωρικής ανάλυσης εικόνων ή ταινιών.
definition: Specification of the spatial resolution of images or movies. @en
definition: Spécification de la résolution spatiale des images ou des films. @fr
definition: Specificazione della risoluzione spaziale di immagini o filmati. @it
definition: Specificatie van de ruimtelijke resolutie van afbeeldingen of films. @nl
preferred label: resolution @en
preferred label: résolution @fr
preferred label: risoluzione @it
preferred label: resolutie @nl
top concept of: SSHOC Multilingual Metadata

περιβάλλον λειτουργίας
type: Concept
source: CLARIN
definition: Προδιαγραφή του περιβάλλοντος λειτουργίας που απαιτείται για την εκτέλεση του εργαλείου/υπηρεσίας.
definition: Specification of the running environment that is required to execute the tool/service. @en
definition: Spécification de l'environnement de fonctionnement nécessaire à l'exécution de l'outil/service. @fr
definition: Specificazione dell'ambiente di esecuzione richiesto per eseguire lo strumento/servizio. @it
definition: Specificatie van de bedrijfsomgeving die nodig is om het gereedschap/de dienst uit te voeren. @nl
preferred label: running environment @en
preferred label: environnement en cours d'exécution @fr
preferred label: ambiente di funzionamento @it
preferred label: bedrijfsomgeving @nl
top concept of: SSHOC Multilingual Metadata

ρυθμός δειγματοληψίας
type: Concept
source: CLARIN
definition: Προδιαγραφή του ρυθμού δειγματοληψίας που χρησιμοποιείται για την καταγραφή.
definition: Specification of the sample rate that is used for the recording. @en
definition: Spécification de la fréquence d'échantillonnage utilisée pour l'enregistrement. @fr
definition: Specificazione della frequenza di campionamento utilizzata per la registrazione. @it
definition: Specificatie van de sample rate die gebruikt wordt voor de opname. @nl
preferred label: sample rate @en
preferred label: taux d'échantillonnage @fr
preferred label: frequenza di campionamento @it
preferred label: steekproefgrootte @nl
top concept of: SSHOC Multilingual Metadata

τμηματοποίηση
type: Concept
source: CLARIN
definition: Καθορισμός των δεικτών χρόνου ή ακολουθίας ο οποίος δείχνει την διαδικασία τμηματιποίησης.
definition: Specification of the pointers in time or sequence that indicates the segmentation process. @en
definition: Spécification des pointeurs dans le temps ou la séquence qui indique le processus de segmentation. @fr
definition: Specificazione dei puntatori nel tempo o nella sequenza che indica il processo di segmentazione. @it
definition: Specificatie van de verwijzingen in tijd of volgorde die het segmentatieproces aangeeft. @nl
preferred label: segmentation @en
preferred label: segmentazione @it
preferred label: segmentatie @nl
top concept of: SSHOC Multilingual Metadata

μέθοδος τμηματοποίησης
type: Concept
source: CLARIN
definition: Ένδειξη της μεθόδου με την οποία επιτεύχθηκε η τμηματοποίηση.
definition: Indication of the method with which the segmentation was achieved. @en
definition: Indication de la méthode avec laquelle la segmentation a été réalisée. @fr
definition: Indicazione del metodo con cui è stata ottenuta la segmentazione. @it
definition: Aanduiding van de methode waarmee de segmentatie tot stand is gekomen. @nl
preferred label: segmentation method @en
preferred label: méthode de segmentation @fr
preferred label: metodo di segmentazione @it
preferred label: segmentatiemethode @nl
top concept of: SSHOC Multilingual Metadata

μέγεθος
type: Concept
source: CLARIN
definition: Το μέγεθος του πόρου σε σχέση με τη μέτρηση SizeUnit με τη μορφή αριθμού.
definition: The size of the resource with regard to the SizeUnit measurement in form of a number. @en
definition: La taille de la ressource par rapport à l'unité de taille, sous la forme d'un nombre. @fr
definition: La dimensione della risorsa rispetto all'unità di misura indicata, sotto forma di numero. @it
definition: De grootte van de bron met betrekking tot de grootte van de betreffende universe in de vorm van een getal. @nl
preferred label: size @en
preferred label: taille @fr
preferred label: dimensione @it
preferred label: grootte @nl
top concept of: SSHOC Multilingual Metadata

μέγεθος ανά γλώσσα
type: Concept
source: CLARIN
definition: Ένδειξη του μεγέθους ανά γλώσσα που περιλαμβάνεται στον πόρο.
definition: Indication of the size per language that is included in the resource. @en
definition: Indication de la taille par langue qui est incluse dans la ressource. @fr
definition: Indicazione della dimensione per lingua che è inclusa nella risorsa. @it
definition: Aanduiding van de omvang per taal die in de bron is opgenomen. @nl
preferred label: size per language @en
preferred label: taille par langue @fr
preferred label: dimensione per lingua @it
preferred label: omvang per taal @nl
top concept of: SSHOC Multilingual Metadata

μέγεθος ανά αντιπροσωπευτικό επίπεδο
type: Concept
source: CLARIN
definition: Ένδειξη του μεγέθους ανά μονάδα αναπαράστασης στον πόρο (π.χ. αριθμός συντακτικών μονάδων, αριθμός σημασιολογικών μονάδων κ.λπ.)
definition: Indication of the size per representational unit in the resource (i.e. Number of syntactic units, number of semantic units etc.) @en
definition: Indication de la taille par unité de représentation dans la ressource (c'est-à-dire le nombre d'unités syntaxiques, le nombre d'unités sémantiques, etc.) @fr
definition: Indicazione della dimensione per unità rappresentazionale nella risorsa (es. numero di unità sintattiche, numero di unità semantiche, ecc.) @it
definition: Vermelding van de omvang per representatieve eenheid in de bron (d.w.z. aantal syntactische eenheden, aantal semantische eenheden enz.) @nl
preferred label: size per representative level @en
preferred label: taille par niveau de représentation @fr
preferred label: dimensione per livello rappresentativo @it
preferred label: omvang per representatief niveau @nl
top concept of: SSHOC Multilingual Metadata

μονάδα μεγέθους
type: Concept
source: CLARIN
definition: Προσδιορισμός της μονάδας μεγέθους που χρησιμοποιείται κατά τον προσδιορισμό του μεγέθους.
definition: Specification of the unit of size that is used when specifying the size. @en
definition: Spécification de l'unité de taille qui est utilisée lors de la spécification de la taille. @fr
definition: Specificazione dell'unità di misura che viene usata quando si specifica la dimensione. @it
definition: Specificatie van de grootte-eenheid die wordt gebruikt bij het specificeren van de grootte. @nl
preferred label: size unit @en
preferred label: unité de taille @fr
preferred label: unità di misura @it
preferred label: maateenheid @nl
top concept of: SSHOC Multilingual Metadata

επικύρωση
type: Concept
source: CLARIN
definition: Ένδειξη της κατάστασης επικύρωσης του πόρου (boolean).
definition: Indication of the validation status of the resource (boolean). @en
definition: Indication de l'état de validation de la ressource (booléen). @fr
definition: Indicazione dello stato di validazione della risorsa (booleano). @it
definition: Aanduiding van de validatiestatus van de bron (booleaans). @nl
preferred label: validation @en
preferred label: convalida @it
preferred label: validatie @nl
top concept of: SSHOC Multilingual Metadata

επίπεδο επικύρωσης
type: Concept
source: CLARIN
definition: Ένδειξη του επιπέδου επικύρωσης (πλήρης, μερική).
definition: Indication of the level of validation (full, partial). @en
definition: Indication du niveau de validation (complet, partiel). @fr
definition: Indicazione del livello di convalida (completa, parziale). @it
definition: Vermelding van het niveau van validatie (volledig, gedeeltelijk). @nl
preferred label: validation level @en
preferred label: niveau de validation @fr
preferred label: livello di convalida @it
preferred label: validatieniveau @nl
top concept of: SSHOC Multilingual Metadata

τρόπος επικύρωσης
type: Concept
source: CLARIN
definition: Ένδειξη της μεθοδολογίας επικύρωσης που εφαρμόστηκε (αυτόματη / με το χέρι, χειρωνακτική).
definition: Indication of the validation methodology that was applied (automatic/manual). @en
definition: Indication de la méthodologie de validation qui a été appliquée (automatique/manuelle). @fr
definition: Indicazione della metodologia di convalida applicata (automatica/manuale). @it
definition: Aanduiding van de toegepaste validatiemethode (automatisch/handmatig). @nl
preferred label: validation mode @en
preferred label: mode de validation @fr
preferred label: modalità di convalida @it
preferred label: validatiemodus @nl
top concept of: SSHOC Multilingual Metadata

τύπος επικύρωσης
type: Concept
source: CLARIN
definition: Ένδειξη του τύπου επικύρωσης που εφαρμόστηκε (βασική επικύρωση, επικύρωση περιεχομένου κ.λπ.).
definition: Indication of the validation type that was applied (formal, content, etc). @en
definition: Indication du type de validation qui a été appliqué (formel, contenu, etc.). @fr
definition: Indicazione del tipo di convalida che è stato applicato (formale, di contenuto, ecc.). @it
definition: Vermelding van het toegepaste validatietype (formeel, inhoud, enz.). @nl
preferred label: validation type @en
preferred label: type de validation @fr
preferred label: tipo di convalida @it
preferred label: validatietype @nl
top concept of: SSHOC Multilingual Metadata

άγνωστο
type: Concept
source: CLARIN
definition: Άγνωστος
definition: Unknown @en
definition: Inconnu @fr
definition: Sconosciuto @it
definition: Onbekend @nl
preferred label: unknown @en
preferred label: inconnu @fr
preferred label: sconosciuto @it
preferred label: onbekend @nl
top concept of: SSHOC Multilingual Metadata

απροσδιόριστο
type: Concept
source: CLARIN
definition: Απροσδιόριστο
definition: Unspecified @en
definition: Non spécifié @fr
definition: Non specificato @it
definition: Ongespecificeerd @nl
preferred label: unspecified @en
preferred label: non spécifié @fr
preferred label: non specificato @it
preferred label: niet gespecificeerd @nl
top concept of: SSHOC Multilingual Metadata

πρόσωπο με πρόσωπο
type: Concept
source: CLARIN
definition: Η μετάδοση του μηνύματος εξασφαλίζει πλήρη πολυαισθητηριακή αλληλεπίδραση μεταξύ ομιλητή και ακροατή(ών)
definition: The transmission of the message ensures full multi-sensorial interaction between speaker and listener(s) @en
definition: La transmission du message assure une interaction multisensorielle complète entre le locuteur et le ou les auditeurs. @fr
definition: La trasmissione del messaggio assicura una piena interazione multisensoriale tra chi parla e chi ascolta @it
definition: De transmissie van de boodschap zorgt voor volledige multi-sensoriële interactie tussen spreker en luisteraar(s) @nl
preferred label: face to face @en
preferred label: face à face @fr
preferred label: faccia a faccia @it
preferred label: face-to-face @nl
top concept of: SSHOC Multilingual Metadata

Πειραματικό περιβάλλον
type: Concept
source: CLARIN
definition: Μετάδοση του περιεχομένου που λαμβάνει χώρα σε ελεγχόμενο περιβάλλον με σκοπό τη δοκιμή υποθέσεων.
definition: A transmission of the content taking place within a controlled environment for the purpose of testing hypotheses. @en
definition: Une transmission du contenu ayant lieu dans un environnement contrôlé dans le but de tester des hypothèses. @fr
definition: Una trasmissione del contenuto che avviene in un ambiente controllato allo scopo di testare delle ipotesi. @it
definition: Een transmissie van de inhoud die plaatsvindt binnen een gecontroleerde omgeving met het doel hypothesen te testen. @nl
preferred label: experimental setting @en
preferred label: cadre expérimental @fr
preferred label: impostazione sperimentale @it
preferred label: experimentele setting @nl
top concept of: SSHOC Multilingual Metadata

μετάδοση
type: Concept
source: CLARIN
definition: Περιεχόμενο που μεταδίδεται σε μεγάλο ακροατήριο μέσω των μέσων μαζικής ενημέρωσης.
definition: Content transmitted to a large audience via the mass media. @en
definition: Contenu transmis à un large public via les médias de masse. @fr
definition: Contenuto trasmesso a un grande pubblico attraverso i mass media. @it
definition: Inhoud die via de massamedia aan een groot publiek wordt doorgegeven. @nl
preferred label: broadcasting @en
preferred label: transmission @fr
preferred label: trasmissione @it
preferred label: uitzending @nl
top concept of: SSHOC Multilingual Metadata

τηλέφωνο
type: Concept
source: CLARIN
definition: Περιεχόμενο που μεταδίδεται μέσω τηλεφώνου.
definition: Content transmitted via telephone. @en
definition: Contenu transmis par téléphone. @fr
definition: Contenuto trasmesso per telefono. @it
definition: Inhoud die via de telefoon wordt doorgegeven. @nl
preferred label: telephone @en
preferred label: téléphone @fr
preferred label: telefono @it
preferred label: telefoon @nl
top concept of: SSHOC Multilingual Metadata

Τεχνική wizard-of-oz
type: Concept
source: CLARIN
definition: Ένα ερευνητικό πείραμα στο οποίο τα υποκείμενα αλληλεπιδρούν με ένα σύστημα υπολογιστή που τα υποκείμενα πιστεύουν ότι είναι αυτόνομο, αλλά το οποίο στην πραγματικότητα λειτουργεί ή λειτουργεί εν μέρει από ένα αόρατο ανθρώπινο ον.
definition: A research experiment in which subjects interact with a computer system that subjects believe to be autonomous, but which is actually being operated or partially operated by an unseen human being. @en
definition: Une expérience de recherche dans laquelle les sujets interagissent avec un système informatique qu'ils croient autonome, mais qui est en fait exploité ou partiellement exploité par une personne invisible. @fr
definition: Un esperimento di ricerca in cui i soggetti interagiscono con un sistema informatico che i soggetti credono essere autonomo, ma che in realtà è gestito o parzialmente gestito da un essere umano invisibile. @it
definition: Een onderzoeksexperiment waarbij proefpersonen interacteren met een computersysteem waarvan de proefpersonen denken dat het autonoom is, maar dat in werkelijkheid wordt bediend of gedeeltelijk wordt bediend door een onzichtbare mens. @nl
preferred label: wizard-of-oz @en
preferred label: expérience du Magicien d'Oz @fr
preferred label: esperimento del mago di Oz @it
preferred label: tovenaar van Oz @nl
top concept of: SSHOC Multilingual Metadata

διάλογος ανθρώπου-μηχανής
type: Concept
source: CLARIN
definition: Αλληλεπίδραση μεταξύ ενός υποκειμένου και ενός μηχανήματος.
definition: Interaction between a subject and a machine. @en
definition: Interaction entre un sujet et une machine. @fr
definition: Interazione tra un soggetto e una macchina. @it
definition: Interactie tussen een subject en een machine. @nl
preferred label: human-machine dialogue @en
preferred label: dialogue homme-machine @fr
preferred label: dialogo uomo-macchina @it
preferred label: mens-machine dialoog @nl
top concept of: SSHOC Multilingual Metadata

άλλη
type: Concept
source: CLARIN
definition: Άλλα
definition: Other @en
definition: Autre @fr
definition: Altro @it
definition: Overig @nl
preferred label: other @en
preferred label: autre @fr
preferred label: altro @it
preferred label: overig @nl
top concept of: SSHOC Multilingual Metadata

δευτερεύον έγγραφο
type: Concept
source: CLARIN
definition: Το περιεχόμενο αναφέρεται ή σχολιάζει ένα κομμάτι πρωτογενών δεδομένων.
definition: The content refers to, or comments on, a piece of primary data. @en
definition: Le contenu fait référence à un élément de données primaires ou le commente. @fr
definition: Il contenuto si riferisce a, o commenta un pezzo di dati primari. @it
definition: De inhoud verwijst naar, of geeft commentaar op, een stuk primaire gegevens. @nl
preferred label: secondary document @en
preferred label: document secondaire @fr
preferred label: documento secondario @it
preferred label: secundair document @nl
top concept of: SSHOC Multilingual Metadata

λογοτεχνία
type: Concept
source: CLARIN
definition: Το περιεχόμενο αφηγείται ένα φανταστικό γεγονός και εκτιμάται για την όμορφη γλώσσα του.
definition: The content narrates an imaginary event and is valued for its beautiful language. @en
definition: Le contenu raconte un événement imaginaire et est apprécié pour sa belle langue. @fr
definition: Il contenuto narra un evento immaginario ed è apprezzato per il suo bel linguaggio. @it
definition: De inhoud verhaalt over een denkbeeldige gebeurtenis en wordt gewaardeerd om zijn mooie taalgebruik. @nl
preferred label: literature @en
preferred label: littérature @fr
preferred label: letteratura @it
preferred label: literatuur @nl
top concept of: SSHOC Multilingual Metadata

ποίηση
type: Concept
source: CLARIN
definition: Το περιεχόμενο συντίθεται σε στίχους ή σε κάποιο παρόμοιο μοτίβο.
definition: The content is composed in verse or some similar pattern. @en
definition: Le contenu est composé en vers ou selon un modèle similaire. @fr
definition: Il contenuto è composto in versi o in qualche schema simile. @it
definition: De inhoud is gecomponeerd in dichtvorm of een soortgelijk patroon. @nl
preferred label: poetry @en
preferred label: poésie @fr
preferred label: poesia @it
preferred label: poëzie @nl
top concept of: SSHOC Multilingual Metadata

τραγούδι
type: Concept
source: CLARIN
definition: Το περιεχόμενο εκτελείται με μελωδία.
definition: The content is performed to a tune. @en
definition: Le contenu est interprété sur une mélodie. @fr
definition: Il contenuto viene eseguito su una melodia. @it
definition: De inhoud is uitgevoerd op een melodie. @nl
preferred label: singing @en
preferred label: chant @fr
preferred label: canto @it
preferred label: zang @nl
top concept of: SSHOC Multilingual Metadata

λαϊκή μυθοπλασία
type: Concept
source: CLARIN
definition: Το περιεχόμενο αφηγείται ένα φανταστικό γεγονός που απευθύνεται στα λαϊκά γούστα.
definition: The content narrates an imaginary event that appeals to popular tastes. @en
definition: Le contenu raconte un événement imaginaire qui fait appel aux goûts populaires. @fr
definition: Il contenuto narra un evento immaginario che fa appello ai gusti popolari. @it
definition: De inhoud betreft een denkbeeldige gebeurtenis die de populaire cultuur aanspreekt. @nl
preferred label: popular fiction @en
preferred label: fiction populaire @fr
preferred label: narrativa popolare @it
preferred label: populaire fictie @nl
top concept of: SSHOC Multilingual Metadata

τελετουργικά/θρησκευτικά κείμενα
type: Concept
source: CLARIN
definition: Το περιεχόμενο αφορά την τέλεση θρησκευτικών τελετών/τελετουργικών που αποτελούνται από καθορισμένους τύπους λόγου.
definition: The content is concerned with the performance of religious rites consisting of prescribed discourse types. @en
definition: Le contenu concerne l'exécution de rites religieux consistant en des types de discours prescrits. @fr
definition: Il contenuto riguarda l'esecuzione di riti religiosi che consistono in tipi di discorsi prescritti. @it
definition: De inhoud heeft betrekking op de uitvoering van religieuze riten die bestaan uit voorgeschreven discourstypen. @nl
preferred label: ritual/religious texts @en
preferred label: textes rituels/religieux @fr
preferred label: testi rituali/religiosi @it
preferred label: rituele/religieuze teksten @nl
top concept of: SSHOC Multilingual Metadata

άρθρο εφημερίδας
type: Concept
source: CLARIN
definition: Το περιεχόμενο είναι μη μυθοπλαστικό και διανέμεται μέσω μιας εφημερίδας, ενός περιοδικού ή του διαδικτύου.
definition: The content is non-fictional distributed via a newspaper, a magazine or the internet. @en
definition: Le contenu est non fictionnel et distribué via un journal, un magazine ou l'internet. @fr
definition: Il contenuto è non-fiction distribuito attraverso un giornale, una rivista o internet. @it
definition: De inhoud is non-fictief en wordt verspreid via een krant, een tijdschrift of het internet. @nl
preferred label: newspaper article @en
preferred label: article de presse @fr
preferred label: articolo di giornale @it
preferred label: krantenartikel @nl
top concept of: SSHOC Multilingual Metadata

χαρακτηριστικά τηλεόρασης / ραδιοφώνου
type: Concept
source: CLARIN
definition: Το περιεχόμενο είναι μη μυθοπλαστικό προφορικό κείμενο ή κείμενο στη Νοηματική Γλώσσα που μεταδίδεται μέσω τηλεόρασης, ραδιοφώνου ή διαδικτύου.
definition: The content is non-fictional spoken/signed text that is broadcast via TV, radio or the internet. @en
definition: Le contenu est un texte oral/signé non fictionnel qui est diffusé par la télévision, la radio ou l'internet. @fr
definition: Il contenuto è un testo parlato/firmato non narrativo che viene trasmesso via TV, radio o internet. @it
definition: De inhoud is niet-fictieve gesproken/ondertekende tekst die wordt uitgezonden via tv, radio of internet. @nl
preferred label: tv/radio features @en
preferred label: fonctionnalités TV / radio @fr
preferred label: caratteristiche tv/radio @it
preferred label: tv-/radiofuncties @nl
top concept of: SSHOC Multilingual Metadata

λόγος
type: Concept
source: CLARIN
definition: Το περιεχόμενο αποτελείται από τις προφορικές εκφράσεις ή εκφράσεις στη Νοηματική Γλώσσα ενός ή περισσότερων συμμετεχόντων. Παράγονται με σκοπό να επικοινωνήσουν κάποια σκέψη ή πρόθεση στους συνομιλητές που είναι παρόντες στο συμβάν.
definition: The content consists of the spoken/signed utterances of one or more actors. They are produced with the purpose of communicating some thought or intent to the interlocutors present to the event. @en
definition: Le contenu est constitué des énoncés parlés/signés d'un ou plusieurs acteurs. Ils sont produits dans le but de communiquer une pensée ou une intention aux interlocuteurs présents à l'événement. @fr
definition: Il contenuto è costituito dalle espressioni parlate/segnate di uno o più attori. Sono prodotti con lo scopo di comunicare un pensiero o un intento agli interlocutori presenti all'evento. @it
definition: De inhoud bestaat uit de gesproken/ondertekende uitingen van een of meer actoren. Ze worden geproduceerd met het doel een gedachte of bedoeling over te brengen aan de bij de gebeurtenis aanwezige gesprekspartners. @nl
preferred label: discourse @en
preferred label: discours @fr
preferred label: discorso @it
top concept of: SSHOC Multilingual Metadata

δράμα
type: Concept
source: CLARIN
definition: Το περιεχόμενο είναι ένα φανταστικό έργο που παίζεται επί σκηνής ή για ραδιοτηλεοπτική μετάδοση.
definition: The content is a fictional play that is acted on stage or for broadcasting. @en
definition: Le contenu est une pièce de théâtre fictive qui est jouée sur scène ou diffusée. @fr
definition: Il contenuto è un'opera fittizia che viene recitata sul palco o per la trasmissione. @it
definition: De inhoud is een fictief toneelstuk dat op het toneel wordt opgevoerd of wordt uitgezonden. @nl
preferred label: drama @en
preferred label: théâtre @fr
preferred label: teatro @it
top concept of: SSHOC Multilingual Metadata

προσωπικές σημειώσεις
type: Concept
source: CLARIN
definition: Το περιεχόμενο είναι μια σύντομη καταγραφή γεγονότων ή σκέψεων που λειτουργούν ως μνημονικό βοήθημα.
definition: The content is a brief record of facts or thoughts that act as a mnemonic aid. @en
definition: Le contenu est un bref enregistrement de faits ou de pensées qui servent d'aide mnémotechnique. @fr
definition: Il contenuto è una breve registrazione di fatti o pensieri che fungono da aiuto mnemonico. @it
definition: De inhoud is een korte optekening van feiten of gedachten die als geheugensteun fungeert. @nl
preferred label: personal notes @en
preferred label: notes personnelles @fr
preferred label: note personali @it
preferred label: persoonlijke notities @nl
top concept of: SSHOC Multilingual Metadata

οργανική μουσική
type: Concept
source: CLARIN
definition: Ορχηστρική μουσική
definition: Instrumental Music @en
definition: Musique instrumentale @fr
definition: Musica strumentale @it
definition: Instrumentale muziek @nl
preferred label: instrumental music @en
preferred label: musique instrumentale @fr
preferred label: musica strumentale @it
preferred label: instrumentale muziek @nl
top concept of: SSHOC Multilingual Metadata

ερεθίσματα
type: Concept
source: CLARIN
definition: Ένας πόρος που δημιουργήθηκε για το σκοπό ενός πειράματος
definition: A resource created for a purpose of an experiment @en
definition: Une ressource créée dans le but d'une expérience @fr
definition: Una risorsa creata per uno scopo di un esperimento @it
definition: Een bron die gemaakt is voor een doel van een experiment @nl
preferred label: stimuli @en
preferred label: stimoli @it
top concept of: SSHOC Multilingual Metadata

διαδραστικό
type: Concept
source: CLARIN
definition: Γλωσσικό γεγονός (ή γλωσσική πράξη) που χαρακτηρίζεται από λεκτική αλληλεπίδραση μεταξύ τουλάχιστον δύο ατόμων
definition: Speech events consists of verbal interaction between at least two Actors. @en
definition: Les événements vocaux consistent en une interaction verbale entre au moins deux acteurs. @fr
definition: Gli eventi del discorso consistono in un'interazione verbale tra almeno due Attori. @it
definition: Spraakgebeurtenissen bestaan uit verbale interactie tussen ten minste twee actoren. @nl
preferred label: interactive @en
preferred label: interactif @fr
preferred label: interattivo @it
preferred label: interactief @nl
top concept of: SSHOC Multilingual Metadata

μη διαδραστική
type: Concept
source: CLARIN
definition: Η ομιλία/το τραγούδι παράγεται χωρίς να αναμένονται εκτεταμένες λεκτικές απαντήσεις από τον/τους ακροατή/ές.
definition: Speech/song produced without expecting extended verbal responses from hearer(s). @en
definition: Parole/chanson produite sans attendre de réponses verbales prolongées de la part des auditeurs. @fr
definition: Discorso/canzone prodotto senza aspettarsi risposte verbali estese da chi ascolta. @it
definition: Spraak/lied geproduceerd zonder uitgebreide verbale reacties te verwachten van de toehoorder(s). @nl
preferred label: non-interactive @en
preferred label: non interactif @fr
preferred label: non interattivo @it
preferred label: niet-interactief @nl
top concept of: SSHOC Multilingual Metadata

ημι-διαδραστική
type: Concept
source: CLARIN
definition: Κατά κύριο λόγο μονόλογος/μονολογική ομιλία που διακόπτεται από επαναλαμβανόμενες παρεμβολές από τον/τους ακροατή/ές.
definition: Primarily monologic speech punctuated by repeated interjections from the hearer(s). @en
definition: Discours essentiellement monologué, ponctué d'interjections répétées de la part du ou des auditeurs. @fr
definition: Discorso prevalentemente monologico punteggiato da ripetute interiezioni da parte dell'ascoltatore (o degli ascoltatori). @it
definition: Voornamelijk monologische spraak onderbroken door herhaalde interjecties van de hoorder(s). @nl
preferred label: semi-interactive @en
preferred label: semi-interactif @fr
preferred label: semi-interattivo @it
preferred label: semi-interactief @nl
top concept of: SSHOC Multilingual Metadata

προκλητός
type: Concept
source: CLARIN
definition: Ο ερευνητής ζητά από τον/τους ομιλητή/ες να παράγουν μεμονωμένα φωνήματα/ λέξεις/ εκφωνήματα/ γραμματικές δομές.
definition: Investigator asks speaker(s) to produce isolated phonemes/ words/ utterances / grammatical structures. @en
definition: L'enquêteur demande au(x) locuteur(s) de produire des phonèmes/ mots/ énoncés/ structures grammaticales isolés. @fr
definition: Lo sperimentatore chiede al/ai parlante/i di produrre fonemi/parole/ enunciati/strutture grammaticali isolati. @it
definition: Onderzoeker vraagt spreker(s) om geïsoleerde fonemen/ woorden/ uitingen/ grammaticale structuren te produceren. @nl
preferred label: elicited @en
preferred label: élicite @fr
preferred label: elicitato @it
preferred label: uitgelokt @nl
top concept of: SSHOC Multilingual Metadata

μη προκλητός
type: Concept
source: CLARIN
definition: Ο ερευνητής δεν παρεμβαίνει λεκτικά στο γλωσσικό γεγονός (εκτός από την απλή παρουσία του ερευνητή).
definition: The researcher does not interfere verbally with the speech event (other than the researcher's mere presence). @en
definition: Le chercheur n'interfère pas verbalement avec l'événement de parole (autre que sa simple présence). @fr
definition: Il ricercatore non interferisce verbalmente con l'evento del discorso (a parte la semplice presenza del ricercatore). @it
definition: De onderzoeker mengt zich niet verbaal in de spraakgebeurtenis (anders dan de loutere aanwezigheid van de onderzoeker). @nl
preferred label: non-elicited @en
preferred label: non sollicité @fr
preferred label: non elicitato @it
preferred label: niet-uitgenodigd @nl
top concept of: SSHOC Multilingual Metadata

χωρίς παρατηρητή
type: Concept
source: CLARIN
definition: Δεν υπάρχει εξωτερικός παρατηρητής.
definition: No outside observer is present. @en
definition: Aucun observateur extérieur n'est présent. @fr
definition: Nessun osservatore esterno è presente. @it
definition: Er is geen externe waarnemer aanwezig. @nl
preferred label: no-observer @en
preferred label: sans observateur @fr
preferred label: geen waarnemer @nl
top concept of: SSHOC Multilingual Metadata

οικογένεια
type: Concept
source: CLARIN
definition: Η πρόσβαση στο συμβάν επικοινωνίας περιορίζεται στους συγγενείς.
definition: The access to the communication event is restricted to relatives. @en
definition: L'accès à l'événement de communication est limité aux proches. @fr
definition: L'accesso all'evento di comunicazione è limitato ai parenti. @it
definition: De toegang tot het communicatiegebeuren is beperkt tot familieleden. @nl
preferred label: family @en
preferred label: famille @fr
preferred label: famiglia @it
preferred label: familie @nl
top concept of: SSHOC Multilingual Metadata

ιδιωτικός
type: Concept
source: CLARIN
definition: Η πρόσβαση στο συμβάν επικοινωνίας περιορίζεται σε συγκεκριμένα άτομα του κοινωνικού περιβάλλοντος.
definition: The access to the communication event is restricted to specific individuals of the social environment. @en
definition: L'accès à l'événement de communication est limité à des individus spécifiques de l'environnement social. @fr
definition: L'accesso all'evento di comunicazione è limitato a specifici individui dell'ambiente sociale. @it
definition: De toegang tot de communicatiegebeurtenis is beperkt tot specifieke individuen van de sociale omgeving. @nl
preferred label: private @en
preferred label: privé @fr
preferred label: privato @it
top concept of: SSHOC Multilingual Metadata

δημόσια
type: Concept
source: CLARIN
definition: Η πρόσβαση στο συμβάν επικοινωνίας επιτρέπεται σε οποιονδήποτε, με ελεύθερο ή ρυθμιζόμενο τρόπο.
definition: The access to the communication event is allowed to whoever, in a free or in a regulated manner. @en
definition: L'accès à l'événement de communication est autorisé à quiconque, de manière libre ou réglementée. @fr
definition: L'accesso all'evento di comunicazione è consentito a chiunque, in modo libero o regolamentato. @it
definition: De toegang tot het communicatiegebeuren wordt aan wie dan ook toegestaan, op vrije of op gereguleerde wijze. @nl
preferred label: public @en
preferred label: pubblico @it
preferred label: openbaar @nl
top concept of: SSHOC Multilingual Metadata

ελεγχόμενο περιβάλλον
type: Concept
source: CLARIN
definition: Η πρόσβαση στο επικοινωνιακό γεγονός που υφίσταται τη συμφωνία για την ανάδειξη μιας γλωσσικής συμπεριφοράς.
definition: The access to the communication event undergoes the agreement to elicit a linguistic behaviour. @en
definition: L’accès à l’événement de communication fait l’objet d’un accord pour obtenir un comportement linguistique. @fr
definition: L'accesso all'evento comunicativo è sottoposto all'accordo per suscitare un comportamento linguistico. @it
definition: De toegang tot de communicatiegebeurtenis ondergaat de overeenkomst om een linguïstisch gedrag uit te lokken. @nl
preferred label: controlled environment @en
preferred label: environnement contrôlé @fr
preferred label: ambiente controllato @it
preferred label: gecontroleerde omgeving @nl
top concept of: SSHOC Multilingual Metadata

ανθρωπολογική γλωσσολογία
type: Concept
source: CLARIN
definition: Η μελέτη της γλώσσας με ιδιαίτερη αναφορά στην κοινωνία και τον πολιτισμό των ομιλητών.
definition: The study of language with particular reference to the society and culture of the speakers. @en
definition: L'étude de la langue avec une référence particulière à la société et à la culture des locuteurs. @fr
definition: Lo studio della lingua con particolare riferimento alla società e alla cultura dei parlanti. @it
definition: De studie van taal met bijzondere aandacht voor de maatschappij en cultuur van de sprekers. @nl
preferred label: anthropological linguistics @en
preferred label: linguistique anthropologique @fr
preferred label: linguistica antropologica @it
preferred label: antropologische linguïstiek @nl
top concept of: SSHOC Multilingual Metadata

εφαρμοσμένη γλωσσολογία
type: Concept
source: CLARIN
definition: Η χρήση γλωσσολογικών μεθόδων όπως εφαρμόζονται στη γλώσσα και την εκπαίδευση, για παράδειγμα στον γραμματισμό ή στην εκμάθηση γλωσσών.
definition: The use of linguistic methods as applied to language and education, for example to literacy or language learning. @en
definition: L'utilisation de méthodes linguistiques appliquées aux langues et à l'éducation, par exemple à l'alphabétisation ou à l'apprentissage des langues. @fr
definition: L'uso di metodi linguistici applicati alla lingua e all'educazione, per esempio all'alfabetizzazione o all'apprendimento delle lingue. @it
definition: Het gebruik van linguïstische methoden zoals toegepast op taal en onderwijs, bijvoorbeeld voor alfabetisering of het leren van talen. @nl
preferred label: applied linguistics @en
preferred label: linguistique appliquée @fr
preferred label: linguistica applicata @it
preferred label: toegepaste linguïstiek @nl
top concept of: SSHOC Multilingual Metadata

γνωστική επιστήμη
type: Concept
source: CLARIN
definition: Η μελέτη της ανθρώπινης νόησης, ιδίως όσον αφορά τη γλώσσα.
definition: The study of human cognition, particularly as it relates to language. @en
definition: L'étude de la cognition humaine, notamment en ce qui concerne le langage. @fr
definition: Lo studio della cognizione umana, in particolare per quanto riguarda il linguaggio. @it
definition: De studie van menselijke cognitie, in het bijzonder met betrekking tot taal. @nl
preferred label: cognitive science @en
preferred label: science cognitive @fr
preferred label: scienza cognitiva @it
preferred label: cognitiewetenschap @nl
top concept of: SSHOC Multilingual Metadata

υπολογιστική γλωσσολογία
type: Concept
source: CLARIN
definition: Η χρήση της επιστήμης των υπολογιστών στη μελέτη της γλώσσας.
definition: The use of computer science in the study of language. @en
definition: L'utilisation de l'informatique dans l'étude du langage. @fr
definition: L'uso dell'informatica nello studio del linguaggio. @it
definition: Het gebruik van informatica bij de studie van taal. @nl
preferred label: computational linguistics @en
preferred label: linguistique informatique @fr
preferred label: linguistica computazionale @it
preferred label: computationele linguïstiek @nl
top concept of: SSHOC Multilingual Metadata

ανάλυση λόγου
type: Concept
source: CLARIN
definition: Η μελέτη των μοτίβων και των νοημάτων πίσω από τον συνδεδεμένο λόγο.
definition: The study of the patterns and meanings behind connected speech. @en
definition: L'étude des modèles et des significations qui se cachent derrière le discours connecté. @fr
definition: Lo studio dei modelli e dei significati che stanno dietro al discorso collegato. @it
definition: De studie van de patronen en betekenissen achter samenhangende spraak. @nl
preferred label: discourse analysis @en
preferred label: analyse du discours @fr
preferred label: analisi del discorso @it
preferred label: discoursanalyse @nl
top concept of: SSHOC Multilingual Metadata

ιατροδικαστική γλωσσολογία
type: Concept
source: CLARIN
definition: Εφαρμογές της γλωσσολογικής επιστήμης στον τομέα του δικαίου.
definition: Applications of linguistic science to the domain of law. @en
definition: Applications de la science linguistique au domaine du droit. @fr
definition: Applicazioni della scienza linguistica al campo del diritto. @it
definition: Toepassingen van de taalwetenschap op het gebied van het recht. @nl
preferred label: forensic linguistics @en
preferred label: linguistique judiciaire @fr
preferred label: linguistica forense @it
preferred label: forensische linguïstiek @nl
top concept of: SSHOC Multilingual Metadata

γενική γλωσσολογία
type: Concept
source: CLARIN
definition: Η ευρεία μελέτη της γλωσσολογίας χωρίς εξειδίκευση σε κάποιο υποπεδίο ή ιδιαίτερη αναφορά σε μια συγκεκριμένη γλωσσολογική θεωρία.
definition: The broad study of linguistics without specialization in any subfield or particular reference to a specific linguistic theory. @en
definition: L'étude générale de la linguistique sans spécialisation dans un sous-domaine ou référence particulière à une théorie linguistique spécifique. @fr
definition: L'ampio studio della linguistica senza specializzazione in alcun sottocampo o particolare riferimento a una specifica teoria linguistica. @it
definition: De brede studie van de linguïstiek zonder specialisatie in een subgebied of bijzondere verwijzing naar een specifieke linguïstische theorie. @nl
preferred label: general linguistics @en
preferred label: linguistique générale @fr
preferred label: linguistica generale @it
preferred label: algemene taalkunde @nl
top concept of: SSHOC Multilingual Metadata

ιστορική γλωσσολογία
type: Concept
source: CLARIN
definition: Η διαχρονική μελέτη της γλωσσικής αλλαγής.
definition: The diachronic study of language change. @en
definition: L'étude diachronique du changement de la langue. @fr
definition: Lo studio diacronico del cambiamento linguistico. @it
definition: De diachrone studie van taalverandering. @nl
preferred label: historical linguistics @en
preferred label: linguistique historique @fr
preferred label: linguistica storica @it
preferred label: historische taalkunde @nl
top concept of: SSHOC Multilingual Metadata

ιστορία της γλωσσολογίας
type: Concept
source: CLARIN
definition: Μελέτη της ιστορίας και της εξέλιξης της γλωσσολογικής επιστήμης.
definition: Study of the history and development of linguistic science. @en
definition: Étude de l'histoire et du développement de la science linguistique. @fr
definition: Studio della storia e dello sviluppo della scienza linguistica. @it
definition: Studie van de geschiedenis en de ontwikkeling van de taalwetenschap. @nl
preferred label: history of linguistics @en
preferred label: histoire de la linguistique @fr
preferred label: storia della linguistica @it
preferred label: geschiedenis van de taalkunde @nl
top concept of: SSHOC Multilingual Metadata

εκμάθηση γλώσσας
type: Concept
source: CLARIN
definition: Η μελέτη της διαδικασίας εκμάθησης μίας ανθρώπινης γλώσσας.
definition: The study of the process of acquiring human language. @en
definition: L'étude du processus d'acquisition du langage humain. @fr
definition: Lo studio del processo di acquisizione del linguaggio umano. @it
definition: De studie van het proces van het verwerven van menselijke taal. @nl
preferred label: language acquisition @en
preferred label: acquisition du langage @fr
preferred label: acquisizione della lingua @it
preferred label: taalverwerving @nl
top concept of: SSHOC Multilingual Metadata

γλωσσική τεκμηρίωση
type: Concept
source: CLARIN
definition: Η θεωρία, η μεθοδολογία και η διαδικασία της γλωσσικής περιγραφής και τεκμηρίωσης, συμπεριλαμβανομένων των γλωσσικών μεθόδων πεδίου και των τεχνικών επιτόπιας έρευνας.
definition: The theory, methodology, and process of language description and documentation, including linguistic field methods and fieldwork techniques. @en
definition: La théorie, la méthodologie et le processus de description et de documentation des langues, y compris les méthodes linguistiques de terrain et les techniques de travail sur le terrain. @fr
definition: La teoria, la metodologia e il processo di descrizione e documentazione linguistica, inclusi i metodi linguistici sul campo e le tecniche di lavoro sul campo. @it
definition: De theorie, de methodologie en het proces van taalbeschrijving en -documentatie, met inbegrip van linguïstische veldmethoden en veldwerktechnieken. @nl
preferred label: language documentation @en
preferred label: documentation linguistique @fr
preferred label: documentazione sulla lingua @it
preferred label: taaldocumentatie @nl
top concept of: SSHOC Multilingual Metadata

λεξικογραφία
type: Concept
source: CLARIN
definition: Η διαδικασία σύνταξης ή μελέτης λεξικών πόρων και λεξικών, είτε μονόγλωσσων είτε πολύγλωσσων.
definition: The process of compiling or studying lexical resources and dictionaries, either monolingual or multilingual. @en
definition: Le processus de compilation ou d'étude des ressources lexicales et des dictionnaires, qu'ils soient monolingues ou multilingues. @fr
definition: Il processo di compilazione o studio delle risorse lessicali e dei dizionari, sia monolingue che multilingue. @it
definition: Het proces van het samenstellen of bestuderen van lexicale bronnen en woordenboeken, hetzij eentalig, hetzij meertalig. @nl
preferred label: lexicography @en
preferred label: lexicographie @fr
preferred label: lessicografia @it
preferred label: lexicografie @nl
top concept of: SSHOC Multilingual Metadata

γλωσσολογία και λογοτεχνία
type: Concept
source: CLARIN
definition: Η εφαρμογή της γλωσσολογικής ανάλυσης σε λογοτεχνικά κείμενα, π.χ. μυθοπλασία, δράμα ή ποίηση.
definition: The application of linguistic analysis to literary texts, e.g., fiction, drama, or poetry. @en
definition: L'application de l'analyse linguistique aux textes littéraires, par exemple, la fiction, le théâtre ou la poésie. @fr
definition: L'applicazione dell'analisi linguistica a testi letterari, per esempio, fiction, dramma o poesia. @it
definition: De toepassing van linguïstische analyse op literaire teksten, bijv. fictie, drama of poëzie. @nl
preferred label: linguistics and literature @en
preferred label: linguistique et littérature @fr
preferred label: linguistica e letteratura @it
preferred label: taalkunde en literatuur @nl
top concept of: SSHOC Multilingual Metadata

γλωσσολογικές θεωρίες
type: Concept
source: CLARIN
definition: Θεωρίες (που υποστηρίζεται ότι είναι) θεμελιώδεις για τη γλωσσολογική επιστήμη, που συχνά καλύπτουν περισσότερα από ένα υποπεδία, όπως η φωνολογία και η σύνταξη.
definition: Theories (argued to be) fundamental to linguistic science, often spanning more than one subfield such as phonology and syntax. @en
definition: Théories (considérées comme) fondamentales pour la science linguistique, couvrant souvent plus d'un sous-domaine, comme la phonologie et la syntaxe. @fr
definition: Teorie (sostenute per essere) fondamentali per la scienza linguistica, spesso abbracciando più di un sottocampo come la fonologia e la sintassi. @it
definition: Theorieën die fundamenteel (zouden zijn) voor de taalwetenschap en vaak meer dan één subgebied bestrijken, zoals fonologie en syntaxis. @nl
preferred label: linguistic theories @en
preferred label: théories linguistiques @fr
preferred label: teorie linguistiche @it
preferred label: taalkundige theorieën @nl
top concept of: SSHOC Multilingual Metadata

μαθηματική γλωσσολογία
type: Concept
source: CLARIN
definition: Το πεδίο μελέτης που ασχολείται με τις μαθηματικές ιδιότητες της γλώσσας.
definition: The field of study which treats the mathematical properties of language. @en
definition: Le domaine d'étude qui traite des propriétés mathématiques du langage. @fr
definition: Il campo di studio che tratta le proprietà matematiche del linguaggio. @it
definition: Het studiegebied dat de wiskundige eigenschappen van taal behandelt. @nl
preferred label: mathematical linguistics @en
preferred label: linguistique mathématique @fr
preferred label: linguistica matematica @it
preferred label: mathematische linguïstiek @nl
top concept of: SSHOC Multilingual Metadata

μορφολογία
type: Concept
source: CLARIN
definition: Η μελέτη της δομής και της σύνθεσης των επιμέρους λέξεων.
definition: The study of the structure and constituency of individual words. @en
definition: L'étude de la structure et de la composition des mots individuels. @fr
definition: Lo studio della struttura e della costituzione delle singole parole. @it
definition: De studie van de structuur en de samenstelling van afzonderlijke woorden. @nl
preferred label: morphology @en
preferred label: morphologie @fr
preferred label: morfologia @it
preferred label: morfologie @nl
top concept of: SSHOC Multilingual Metadata

νευρογλωσσολογία
type: Concept
source: CLARIN
definition: Η μελέτη της δομής του εγκεφάλου και της φυσικής αναπαράστασης της γλώσσας στον εγκέφαλο.
definition: The study of brain structure and the physical representation of language in the brain. @en
definition: L'étude de la structure du cerveau et de la représentation physique du langage dans le cerveau. @fr
definition: Lo studio della struttura del cervello e la rappresentazione fisica del linguaggio nel cervello. @it
definition: De studie van de hersenstructuur en de fysieke representatie van taal in de hersenen. @nl
preferred label: neurolinguistics @en
preferred label: neurolinguistique @fr
preferred label: neurolinguistica @it
preferred label: neurolinguïstiek @nl
top concept of: SSHOC Multilingual Metadata

φιλοσοφία της γλώσσας
type: Concept
source: CLARIN
definition: Η εφαρμογή της φιλοσοφίας στη γλώσσα και τη γλωσσική θεωρία.
definition: The application of philosophy to language and linguistic theory. @en
definition: L'application de la philosophie au langage et à la théorie linguistique. @fr
definition: L'applicazione della filosofia al linguaggio e alla teoria linguistica. @it
definition: De toepassing van filosofie op taal en linguïstische theorie. @nl
preferred label: philosophy of language @en
preferred label: la philosophie du langage @fr
preferred label: filosofia del linguaggio @it
preferred label: taalfilosofie @nl
top concept of: SSHOC Multilingual Metadata

φωνητική
type: Concept
source: CLARIN
definition: Η μελέτη και η ταξινόμηση της δομής, της άρθρωσης και της αντίληψης των ήχων της ομιλίας.
definition: The study and classification of the structure, articulation and perception of speech sounds. @en
definition: L'étude et la classification de la structure, de l'articulation et de la perception des sons de la parole. @fr
definition: Lo studio e la classificazione della struttura, dell'articolazione e della percezione dei suoni del discorso. @it
definition: De studie en classificatie van de structuur, articulatie en perceptie van spraakklanken. @nl
preferred label: phonetics @en
preferred label: phonétique @fr
preferred label: fonetica @it
preferred label: fonetiek @nl
top concept of: SSHOC Multilingual Metadata

φωνολογία
type: Concept
source: CLARIN
definition: Η μελέτη των μοτίβων και των αρχών πίσω από το ηχητικό σύστημα μιας γλώσσας ή των γλωσσών γενικότερα.
definition: The study of the patterns and principles behind the sound system of a language, or languages in general. @en
definition: L'étude des modèles et des principes qui sous-tendent le système sonore d'une langue, ou des langues en général. @fr
definition: Lo studio dei modelli e dei principi alla base del sistema sonoro di una lingua, o delle lingue in generale. @it
definition: De studie van de patronen en principes achter het klanksysteem van een taal, of talen in het algemeen. @nl
preferred label: phonology @en
preferred label: phonologie @fr
preferred label: fonologia @it
preferred label: fonologie @nl
top concept of: SSHOC Multilingual Metadata

Πραγματολογία
type: Concept
source: CLARIN
definition: Η μελέτη της χρήσης της γλώσσας σε σχέση με το πλαίσιο στο οποίο μιλιέται.
definition: The study of the use of language in terms of the context in which it is spoken. @en
definition: L'étude de l'utilisation de la langue en fonction du contexte dans lequel elle est parlée. @fr
definition: Lo studio dell'uso del linguaggio in termini di contesto in cui viene parlato. @it
definition: De studie van het gebruik van taal in termen van de context waarin ze wordt gesproken. @nl
preferred label: pragmatics @en
preferred label: pragmatique @fr
preferred label: pragmatica @it
preferred label: pragmatiek @nl
top concept of: SSHOC Multilingual Metadata

ψυχογλωσσολογία
type: Concept
source: CLARIN
definition: Η εφαρμογή της ψυχολογίας στη γλωσσολογία, όσον αφορά τους ψυχολογικούς μηχανισμούς πίσω από τη γλώσσα, όπως η μνήμη και η νοημοσύνη (Πειραματική Ψυχογλωσσολογία).
definition: The application of psychology to linguistics, in terms of the psychological mechanisms behind language, such as memory and intelligence (Experimental Psycholinguistics). @en
definition: L'application de la psychologie à la linguistique, en termes de mécanismes psychologiques derrière le langage, tels que la mémoire et l'intelligence (Psycholinguistique expérimentale). @fr
definition: L'applicazione della psicologia alla linguistica, in termini di meccanismi psicologici dietro il linguaggio, come la memoria e l'intelligenza (Psicolinguistica sperimentale). @it
definition: De toepassing van de psychologie op de taalkunde, in termen van de psychologische mechanismen achter taal, zoals geheugen en intelligentie (Experimentele Psycholinguïstiek). @nl
preferred label: psycholinguistics @en
preferred label: psycholinguistique @fr
preferred label: psicolinguistica @it
preferred label: psycholinguïstiek @nl
top concept of: SSHOC Multilingual Metadata

σημασιολογία
type: Concept
source: CLARIN
definition: Η μελέτη της σημασίας των γλωσσικών δομών.
definition: The study of the meaning of linguistic structures. @en
definition: L'étude de la signification des structures linguistiques. @fr
definition: Lo studio del significato delle strutture linguistiche. @it
definition: De studie van de betekenis van linguïstische structuren. @nl
preferred label: semantics @en
preferred label: sémantique @fr
preferred label: semantica @it
preferred label: semantiek @nl
top concept of: SSHOC Multilingual Metadata

κοινωνιογλωσσολογία
type: Concept
source: CLARIN
definition: Η μελέτη της γλώσσας στο πλαίσιο της κοινωνίας που την ομιλεί.
definition: The study of language in context of the society that speaks it. @en
definition: L'étude de la langue dans le contexte de la société qui la parle. @fr
definition: Lo studio della lingua nel contesto della società che la parla. @it
definition: De studie van taal in de context van de samenleving die de taal spreekt. @nl
preferred label: sociolinguistics @en
preferred label: sociolinguistique @fr
preferred label: sociolinguistica @it
preferred label: sociolinguïstiek @nl
top concept of: SSHOC Multilingual Metadata

σύνταξη
type: Concept
source: CLARIN
definition: Η μελέτη των γραμματικών σχέσεων μεταξύ των λέξεων και άλλων μονάδων μέσα σε μια πρόταση" (Concise Oxford Dictionary of Linguistics). Να διακρίνεται από τη μορφολογία, η οποία εφαρμόζεται σε μονάδες μικρότερες από τη λέξη.
definition: The study of grammatical relations between words and other units within a sentence' (Concise Oxford Dictionary of Linguistics). To be distinguished from morphology, which applies to units smaller than the word. @en
definition: L'étude des relations grammaticales entre les mots et les autres unités d'une phrase" (Concise Oxford Dictionary of Linguistics). À distinguer de la morphologie, qui s'applique à des unités plus petites que le mot. @fr
definition: Lo studio delle relazioni grammaticali tra le parole e le altre unità all'interno di una frase" (Concise Oxford Dictionary of Linguistics). Da distinguere dalla morfologia, che si applica a unità più piccole della parola. @it
definition: De studie van grammaticale relaties tussen woorden en andere eenheden binnen een zin" (Concise Oxford Dictionary of Linguistics). Te onderscheiden van morfologie, die van toepassing is op eenheden kleiner dan het woord. @nl
preferred label: syntax @en
preferred label: syntaxe @fr
preferred label: sintassi @it
preferred label: syntaxis @nl
top concept of: SSHOC Multilingual Metadata

γλωσσολογία κειμένων και σωμάτων κειμένων
type: Concept
source: CLARIN
definition: Η μελέτη των γλωσσικών ιδιοτήτων ενός εκτεταμένου αποσπάσματος, κειμένου ή σώματος κειμένων.
definition: The study of the linguistic properties of an extended passage, text, or corpus of texts. @en
definition: L'étude des propriétés linguistiques d'un long passage, d'un texte ou d'un corpus de textes. @fr
definition: Lo studio delle proprietà linguistiche di un passaggio esteso, un testo o un corpus di testi. @it
definition: De studie van de linguïstische eigenschappen van een uitgebreide passage, tekst of corpus van teksten. @nl
preferred label: text and corpus linguistics @en
preferred label: linguistique textuelle et de corpus @fr
preferred label: linguistica del testo e del corpus @it
preferred label: tekst- en corpuslinguïstiek @nl
top concept of: SSHOC Multilingual Metadata

μετάφραση και διερμηνεία
type: Concept
source: CLARIN
definition: Η μελέτη της πράξης μετατροπής μιας γλώσσας σε μια άλλη, είτε μέσω της ομιλίας είτε μέσω της γραφής.
definition: The study of the act of converting one language into another, either via speech or writing. @en
definition: L'étude de l'acte de convertir une langue en une autre, que ce soit par la parole ou l'écriture. @fr
definition: Lo studio dell'atto di convertire una lingua in un'altra, sia attraverso il discorso che la scrittura. @it
definition: De studie van de handeling van het omzetten van een taal in een andere taal, hetzij via spraak of schrift. @nl
preferred label: translating and interpreting @en
preferred label: la traduction et l'interprétation @fr
preferred label: traduzione e interpretariato @it
preferred label: vertalen en interpreteren @nl
top concept of: SSHOC Multilingual Metadata

τυπολογία
type: Concept
source: CLARIN
definition: Η μελέτη των ομοιοτήτων και των διαφορών μεταξύ των γλωσσών, ανεξάρτητα από οποιαδήποτε γενετική σχέση, και η προκύπτουσα κατηγοριοποίηση της γλώσσας σε "τύπους".
definition: The study of the similarites and differences between languages, regardless of any genetic relation, and the resulting categorization of language into 'types'. @en
definition: L'étude des similitudes et des différences entre les langues, indépendamment de toute relation génétique, et la catégorisation des langues en "types" qui en résulte. @fr
definition: Lo studio delle somiglianze e delle differenze tra le lingue, indipendentemente da qualsiasi relazione genetica, e la conseguente categorizzazione della lingua in "tipi". @it
definition: De studie van de gelijkenissen en verschillen tussen talen, los van enige genetische relatie, en de daaruit voortvloeiende categorisering van taal in "typen". @nl
preferred label: typology @en
preferred label: typologie @fr
preferred label: tipologia @it
top concept of: SSHOC Multilingual Metadata

συστήματα γραφής
type: Concept
source: CLARIN
definition: Η οπτική αναπαράσταση του προφορικού λόγου σε χαρτί ή άλλα μέσα, καθώς και τα ζητήματα που σχετίζονται με τη γραφή και τη δημιουργία ενός συστήματος γραφής.
definition: The visual representation of spoken language on paper or other media, and the issues involved in writing and creating a writing system. @en
definition: La représentation visuelle de la langue parlée sur papier ou sur d'autres supports, et les questions liées à l'écriture et à la création d'un système d'écriture. @fr
definition: La rappresentazione visiva della lingua parlata su carta o altri media, e le questioni coinvolte nella scrittura e nella creazione di un sistema di scrittura. @it
definition: De visuele weergave van gesproken taal op papier of andere media, en de problemen die gepaard gaan met het schrijven en creëren van een schrijfsysteem. @nl
preferred label: writing systems @en
preferred label: systèmes d'écriture @fr
preferred label: sistemi di scrittura @it
preferred label: schrijfsystemen @nl
top concept of: SSHOC Multilingual Metadata

ήχος
type: Concept
source: Based on http://www.ietf.org/rfc/rfc2046.txt
definition: Οποιοδήποτε περιεχόμενο ηλεκτρονικών μέσων που απαιτεί συσκευή εξόδου ήχου (όπως ηχείο ή τηλέφωνο) για την αναπαραγωγή των περιεχομένων.
definition: Any electronic media content that requires an audio output device (such as a speaker or a telephone) to "display" the contents. @en
definition: Tout contenu de média électronique qui nécessite un dispositif de sortie audio (tel qu'un haut-parleur ou un téléphone) pour " afficher " le contenu. @fr
definition: Qualsiasi contenuto multimediale elettronico che richiede un dispositivo di uscita audio (come un altoparlante o un telefono) per "visualizzare" il contenuto. @it
definition: Elke elektronische media-inhoud waarvoor een audio-uitgangsapparaat (zoals een luidspreker of een telefoon) nodig is om de inhoud "weer te geven". @nl
preferred label: audio @en
top concept of: SSHOC Multilingual Metadata

βίντεο
type: Concept
source: http://www.ietf.org/rfc/rfc2046.txt
definition: δεδομένα βίντεο. Το "βίντεο" απαιτεί τη δυνατότητα απεικόνισης κινούμενων εικόνων, που συνήθως περιλαμβάνει εξειδικευμένο υλικό και λογισμικό.
definition: video data. "Video" requires the capability to display moving images, typically including specialized hardware and software. @en
definition: données vidéo. La "vidéo" nécessite la capacité d'afficher des images en mouvement, ce qui inclut généralement du matériel et des logiciels spécialisés. @fr
definition: dati video. "Video" richiede la capacità di visualizzare immagini in movimento, tipicamente includendo hardware e software specializzati. @it
definition: videogegevens. Voor "video" is het vermogen vereist om bewegende beelden weer te geven, doorgaans met inbegrip van gespecialiseerde hardware en software. @nl
preferred label: video @en
preferred label: vidéo @fr
top concept of: SSHOC Multilingual Metadata

εικόνα
type: Concept
source: http://www.ietf.org/rfc/rfc2046.txt
definition: δεδομένα εικόνας. Η "εικόνα" απαιτεί μια συσκευή απεικόνισης (όπως μια γραφική οθόνη, έναν εκτυπωτή γραφικών ή ένα μηχάνημα FAX) για την προβολή των πληροφοριών.
definition: image data. "Image" requires a display device (such as a graphical display, a graphics printer, or a FAX machine) to view the information. @en
definition: données d'image. Une "image" nécessite un dispositif d'affichage (tel qu'un écran graphique, une imprimante graphique ou un télécopieur) pour visualiser les informations. @fr
definition: dati di immagine. "Immagine" richiede un dispositivo di visualizzazione (come un display grafico, una stampante grafica o una macchina FAX) per visualizzare le informazioni. @it
definition: beeldgegevens. "Beeld" vereist een weergaveapparaat (zoals een grafische display, een grafische printer of een FAX-apparaat) om de informatie te bekijken. @nl
preferred label: image @en
preferred label: immagine @it
preferred label: afbeelding @nl
top concept of: SSHOC Multilingual Metadata

έγγραφο
type: Concept
source: Based on Wikipedia
definition: Οποιοδήποτε περιεχόμενο ηλεκτρονικών μέσων (εκτός από προγράμματα υπολογιστών ή αρχεία συστήματος) που προορίζεται να χρησιμοποιηθεί είτε σε ηλεκτρονική μορφή είτε ως έντυπο αποτέλεσμα.
definition: Any electronic media content (other than computer programs or system files) that is intended to be used in either electronic form or as printed output. @en
definition: Tout contenu de média électronique (autre que les programmes informatiques ou les fichiers système) destiné à être utilisé sous forme électronique ou imprimée. @fr
definition: Qualsiasi contenuto dei media elettronici (diverso dai programmi per computer o dai file di sistema) che è destinato ad essere utilizzato in forma elettronica o come output stampato. @it
definition: Elke elektronische media-inhoud (anders dan computerprogramma's of systeembestanden) die bedoeld is om te worden gebruikt in elektronische vorm of als afgedrukte output. @nl
preferred label: document @en
preferred label: documento @it
top concept of: SSHOC Multilingual Metadata

σχέδιο
type: Concept
source: http://en.wiktionary.org/wiki/drawing
definition: Μια εικόνα, απεικόνιση, διάγραμμα ή αναπαράσταση
definition: A picture, likeness, diagram or representation @en
definition: Une image, une ressemblance, un diagramme ou une représentation @fr
definition: Un'immagine, somiglianza, diagramma o rappresentazione @it
definition: Een foto, gelijkenis, diagram of afbeelding @nl
preferred label: drawing @en
preferred label: dessein @fr
preferred label: disegno @it
preferred label: tekening @nl
top concept of: SSHOC Multilingual Metadata

κείμενο
type: Concept
source: Wikipedia
definition: Κάθε πληροφορία που βασίζεται σε κείμενο και είναι διαθέσιμη σε ψηφιακά κωδικοποιημένη μορφή αναγνώσιμη από τον άνθρωπο.
definition: any text-based information that is available in a digitally encoded human-readable format @en
definition: toute information textuelle disponible dans un format numériquement codé et lisible par l'homme. @fr
definition: qualsiasi informazione basata sul testo che è disponibile in un formato digitale codificato e leggibile dall'uomo @it
definition: alle op tekst gebaseerde informatie die beschikbaar is in een digitaal gecodeerd, voor mensen leesbaar formaat @nl
preferred label: text @en
preferred label: texte @fr
preferred label: testo @it
preferred label: tekst @nl
top concept of: SSHOC Multilingual Metadata

μονόλογος
type: Concept
source: CLARIN
definition: Επικοικωνιακό γεγονός με μόνο ένα συμμετέχοντα.
definition: Communication event with only one main participant. @en
definition: Événement de communication avec un seul participant principal. @fr
definition: Evento di comunicazione con un solo partecipante principale. @it
definition: Communicatiegebeurtenis met slechts één hoofddeelnemer. @nl
preferred label: monologue @en
preferred label: monologo @it
preferred label: monoloog @nl
top concept of: SSHOC Multilingual Metadata

διάλογος
type: Concept
source: CLARIN
definition: Γεγονός επικοινωνίας μεταξύ δύο συμμετεχόντων.
definition: Communication event between two participants. @en
definition: Événement de communication entre deux participants. @fr
definition: Evento di comunicazione tra due partecipanti. @it
definition: Communicatiegebeurtenis tussen twee deelnemers. @nl
preferred label: dialogue @en
preferred label: dialogo @it
preferred label: dialoog @nl
top concept of: SSHOC Multilingual Metadata

συνομιλία
type: Concept
source: CLARIN
definition: Επικοινωνιακό γεγονός με περισσότερους από έναν συνομιλητές.
definition: Communication event with more than two participants. @en
definition: Événement de communication avec plus de deux participants. @fr
definition: Evento di comunicazione con più di due partecipanti. @it
definition: Communicatiegebeurtenis met meer dan twee deelnemers. @nl
preferred label: conversation @en
preferred label: conversazione @it
preferred label: gesprek @nl
top concept of: SSHOC Multilingual Metadata

μη φυσική μορφή
type: Concept
source: CLARIN
definition: Συνεδρίες όπου ο αριθμός των συμμετεχόντων δεν καθορίζει τη δομή του επικοινωνιακού γεγονότος.
definition: Sessions where the number of participants does not define the structure of the communication event. @en
definition: Sessions où le nombre de participants ne définit pas la structure de l'événement de communication. @fr
definition: Sessioni in cui il numero di partecipanti non definisce la struttura dell'evento comunicativo. @it
definition: Sessies waarbij het aantal deelnemers niet bepalend is voor de structuur van de communicatiegebeurtenis. @nl
preferred label: not a natural format @en
preferred label: pas un format naturel @fr
preferred label: non un formato naturale @it
preferred label: geen natuurlijk formaat @nl
top concept of: SSHOC Multilingual Metadata

αυθόρμητη
type: Concept
source: CLARIN
definition: αυθόρμητη ομιλία/τραγούδι
definition: Unprompted speech/song @en
definition: Discours / chanson non sollicités @fr
definition: Discorso(canzone non sollecitato. @it
definition: Onuitgesproken toespraak/lied @nl
preferred label: spontaneous @en
preferred label: spontané @fr
preferred label: spontaneo @it
preferred label: spontaan @nl
top concept of: SSHOC Multilingual Metadata

ημι-αυθόρμητη
type: Concept
source: CLARIN
definition: Προκλητή ομιλία.τραγούδι
definition: Prompted speech/song. @en
definition: Discours / chanson incités. @fr
definition: Discorso/canzone sollecitato. @it
definition: Gesproken toespraak / lied. @nl
preferred label: semi-spontaneous @en
preferred label: semi-spontané @fr
preferred label: semi-spontaneo @it
preferred label: semi-spontaan @nl
top concept of: SSHOC Multilingual Metadata

προπαρασκευασμένος
type: Concept
source: CLARIN
definition: Ο ομιλητής/η ομιλήτρια εκ των προτέρων προετοιμάζει με λεπτομέρεια τη δομή και το περιεχόμενο της παρουσίασής του/της.
definition: The speaker prepares in detail the structure and content of his/her "performance" in advance @en
definition: L'orateur prépare à l'avance et en détail la structure et le contenu de sa "performance". @fr
definition: L'oratore prepara in dettaglio la struttura e il contenuto della sua "performance" in anticipo @it
definition: De spreker bereidt de structuur en inhoud van zijn "voorstelling" van tevoren in detail voor @nl
preferred label: planned @en
preferred label: planifié @fr
preferred label: pianificato @it
preferred label: gepland @nl
top concept of: SSHOC Multilingual Metadata

πολύ χαμηλό
type: Concept
source: CLARIN
definition: Πολύ χαμηλή ποιότητα
definition: Very Low Quality @en
definition: Qualité très faible @fr
definition: Qualità molto bassa @it
definition: Zeer lage kwaliteit @nl
preferred label: very low @en
preferred label: très faible @fr
preferred label: molto basso @it
preferred label: zeer laag @nl
top concept of: SSHOC Multilingual Metadata

χαμηλή
type: Concept
source: CLARIN
definition: Χαμηλή ποιότητα
definition: Low quality @en
definition: Qualité médiocre @fr
definition: Bassa qualità @it
definition: Lage kwaliteit @nl
preferred label: low @en
preferred label: faible @fr
preferred label: basso @it
preferred label: laag @nl
top concept of: SSHOC Multilingual Metadata

κανονική
type: Concept
source: CLARIN
definition: Κανονική ποιότητα
definition: Normal Quality @en
definition: qualité normale @fr
definition: qualità normale @it
definition: Normale kwaliteit @nl
preferred label: normal @en
preferred label: normale @it
preferred label: normaal @nl
top concept of: SSHOC Multilingual Metadata

καλή
type: Concept
source: CLARIN
definition: Καλή ποιότητα
definition: Good Quality @en
definition: Bonne qualité @fr
definition: Buona qualità @it
definition: Goede kwaliteit @nl
preferred label: good @en
preferred label: bon @fr
preferred label: bene @it
preferred label: goed @nl
top concept of: SSHOC Multilingual Metadata

πολύ καλό
type: Concept
source: CLARIN
definition: Πολύ καλή ποιότητα
definition: Very Good Quality @en
definition: Très bonne qualité @fr
definition: Qualità molto buona @it
definition: Zeer goede kwaliteit @nl
preferred label: very good @en
preferred label: très bien @fr
preferred label: molto buono @it
preferred label: zeer goed @nl
top concept of: SSHOC Multilingual Metadata

ανάλυση bit
type: Concept
source: wikipedia
definition: Στον ψηφιακό ήχο, το βάθος bit περιγράφει τον αριθμό των bit πληροφορίας που καταγράφονται για κάθε δείγμα
definition: In digital audio, bit depth describes the number of bits of information recorded for each sample @en
definition: En audio numérique, la profondeur de bits décrit le nombre de bits d'information enregistrés pour chaque échantillon. @fr
definition: Nell'audio digitale, la profondità di bit descrive il numero di bit di informazioni registrate per ogni campione @it
definition: In digitale audio beschrijft de bitdiepte het aantal bits aan informatie opgenomen voor elke sample @nl
preferred label: bit resolution @en
preferred label: résolution en bits @fr
preferred label: risoluzione di bit @it
preferred label: bit resolutie @nl
top concept of: SSHOC Multilingual Metadata

συμπίεση
type: Concept
source: wikipedia
definition: συμπίεση είναι μια μορφή συμπίεσης δεδομένων που αποσκοπεί στη μείωση της απαίτησης εύρους ζώνης μετάδοσης των ψηφιακών ροών πολυμέσων και του μεγέθους αποθήκευσης των αρχείων πολυμέσων.
definition: compression is a form of data compression designed to reduce the transmission bandwidth requirement of digital media streams and the storage size of media files. @en
definition: La compression est une forme de compression des données conçue pour réduire la largeur de bande nécessaire à la transmission des flux de médias numériques et la taille de stockage des fichiers multimédias. @fr
definition: La compressione è una forma di compressione dei dati progettata per ridurre la richiesta di banda di trasmissione dei flussi multimediali digitali e la dimensione di archiviazione dei file multimediali. @it
definition: Compressie is een vorm van gegevenscompressie die is ontworpen om de vereiste transmissiebandbreedte van digitale mediastromen en de opslaggrootte van mediabestanden te beperken. @nl
preferred label: compression @en
preferred label: compressione @it
preferred label: compressie @nl
top concept of: SSHOC Multilingual Metadata

σειρά byte
type: Concept
source: CLARIN
definition: η σειρά με την οποία παρουσιάζονται τα bytes (και μερικές φορές τα bits) προκειμένου να αναπαρασταθεί κάποιο είδος δεδομένων
definition: the order in which bytes (and sometimes bits) are presented in order to represent some kind of data @en
definition: l'ordre dans lequel les octets (et parfois les bits) sont présentés afin de représenter un type de données. @fr
definition: l'ordine in cui i byte (e talvolta i bit) sono presentati per rappresentare un certo tipo di dati @it
definition: de volgorde waarin bytes (en soms bits) worden gepresenteerd om een bepaald soort gegevens weer te geven @nl
preferred label: byte order @en
preferred label: ordre des octets @fr
preferred label: ordine di byte @it
preferred label: byte-volgorde @nl
top concept of: SSHOC Multilingual Metadata

big endian
type: Concept
source: DBroeder
definition: Σειρά byte με πρώτο το πιο σημαντικό byte (ή bit).
definition: Byte order with the most significant byte (or bit) first. @en
definition: Ordre des octets, l'octet (ou le bit) le plus significatif étant le premier. @fr
definition: Ordine dei byte con il byte (o bit) più significativo per primo. @it
definition: Byte-volgorde met de meest significante byte (of bit) eerst. @nl
top concept of: SSHOC Multilingual Metadata

little endian
type: Concept
source: DBroeder
definition: Σειρά byte με πρώτο το λιγότερο σημαντικό byte (ή bit).
definition: Byte order with least significant byte (or bit) first. @en
definition: Ordre des octets, l'octet (ou le bit) le moins significatif étant le premier. @fr
definition: Ordine dei byte con il byte (o bit) meno significativo per primo. @it
definition: Bytevolgorde met de minst significante byte (of bit) eerst. @nl
preferred label: petit endian @fr
preferred label: kleine endian @nl
top concept of: SSHOC Multilingual Metadata

μορφότυπο αρχείου ήχου
type: Concept
source: wikipedia
definition: Το μορφότυπο αρχείου ήχου είναι το μορφότυπο αρχείου για την αποθήκευση ηχητικών δεδομένων σε ένα σύστημα υπολογιστή/σύστημα πληροφορικής
definition: audio file format is a file format for storing audio data on a computer system @en
definition: le format de fichier audio est un format de fichier permettant de stocker des données audio sur un système informatique @fr
definition: il formato di file audio è un formato di file per la memorizzazione di dati audio su un sistema informatico. @it
definition: audiobestandsformaat is een bestandsformaat voor het opslaan van audiogegevens op een computersysteem @nl
preferred label: audio file format @en
preferred label: format de fichier audio @fr
preferred label: formato di file audio @it
preferred label: audiobestandsformaat @nl
top concept of: SSHOC Multilingual Metadata

Διάρκεια πλήρους βάσης δεδομένων
type: Concept
source: CLARIN
definition: η διάρκεια όλων των ηχογραφήσεων στο corpus
definition: the duration of all recordings in the corpus @en
definition: la durée de tous les enregistrements du corpus @fr
definition: la durata di tutte le registrazioni nel corpus @it
definition: de duur van alle opnames in het corpus @nl
preferred label: duration of full database @en
preferred label: durée de la base de données complète @fr
preferred label: durata del database completo @it
preferred label: duur van volledige databank @nl
top concept of: SSHOC Multilingual Metadata

διάρκεια αποτελεσματικού λόγου
type: Concept
source: CLARIN
definition: διάρκεια αποτελεσματικού λόγου στο σώμα κειμένων
definition: duration of effective speech in corpus @en
definition: durée de la parole effective dans le corpus @fr
definition: durata del discorso effettivo nel corpus @it
definition: duur van effectieve spraak in het corpus @nl
preferred label: duration of effective speech @en
preferred label: durée du discours effectif @fr
preferred label: durata del discorso effettivo @it
preferred label: duur van effectieve toespraak @nl
top concept of: SSHOC Multilingual Metadata

αριθμός ομιλητών
type: Concept
source: CLARIN
definition: ο αριθμός των ομιλητών στην ηχογράφηση
definition: the number of speakers in the recording @en
definition: le nombre de locuteurs dans l'enregistrement @fr
definition: il numero di parlanti nella registrazione @it
definition: het aantal sprekers in de opname @nl
preferred label: number of speakers @en
preferred label: nombre d'intervenants @fr
preferred label: numero di parlanti @it
preferred label: aantal sprekers @nl
top concept of: SSHOC Multilingual Metadata

υλικό πλατφόρμας εγγραφής
type: Concept
source: CLARIN
definition: τα χαρακτηριστικά/οι προδιαγραφές του υλικού/υλισμικού (hardware) της πλατφόρμας εγγραφής
definition: the nature of the recording platform hardware @en
definition: la nature du matériel de la plate-forme d'enregistrement @fr
definition: la natura dell'hardware della piattaforma di registrazione @it
definition: De aard van de hardware van het opnameplatform @nl
preferred label: recording platform hardware @en
preferred label: matériel de plateforme d’enregistrement @fr
preferred label: hardware della piattaforma di registrazione @it
preferred label: hardware voor opnameplatform @nl
top concept of: SSHOC Multilingual Metadata

Λογισμικό πλατφόρμας εγγραφής
type: Concept
source: CLARIN
definition: το λογισμικό που χρησιμοποιείται για την πλατφόρμα καταγραφής
definition: the software used for the recording platform @en
definition: le logiciel utilisé pour la plate-forme d'enregistrement @fr
definition: il software utilizzato per la piattaforma di registrazione @it
definition: De software die voor het opnameplatform is gebruikt @nl
preferred label: recording platform software @en
preferred label: logiciel de plateforme d’enregistrement @fr
preferred label: software della piattaforma di registrazione @it
preferred label: software voor opnameplatform @nl
top concept of: SSHOC Multilingual Metadata

περιβάλλον καταγραφής
type: Concept
source: CLARIN
definition: το περιβάλλον όπου πραγματοποιήθηκε η ηχογράφηση
definition: the environment where the recording took place @en
definition: l'environnement dans lequel l'enregistrement a eu lieu @fr
definition: l'ambiente in cui è avvenuta la registrazione @it
definition: De omgeving waar de opname plaatsvond @nl
preferred label: recording environment @en
preferred label: environnement d’enregistrement @fr
preferred label: ambiente di registrazione @it
preferred label: opname-omgeving @nl
top concept of: SSHOC Multilingual Metadata

σπίτι/γραφείο
type: Concept
source: CLARIN
definition: περιβάλλον καταγραφής στο σπίτι/γραφείο
definition: home/office recording environment @en
definition: environnement d'enregistrement à domicile ou au bureau @fr
definition: ambiente di registrazione casa/ufficio @it
definition: Opnameomgeving thuis/op kantoor. @nl
preferred label: home/office @en
preferred label: Domicile/Bureau @fr
preferred label: casa/ufficio @it
preferred label: thuis/kantoor @nl
top concept of: SSHOC Multilingual Metadata

στούντιο
type: Concept
source: CLARIN
definition: η εγγραφή πραγματοποιήθηκε σε στούντιο
definition: studio recording environment @en
definition: environnement d'enregistrement en studio @fr
definition: ambiente di registrazione in studio @it
definition: studio-opname-omgeving @nl
preferred label: studio @en
top concept of: SSHOC Multilingual Metadata

όχημα
type: Concept
source: CLARIN
definition: η καταγραφή πραγματοποιήθηκε σε όχημα
definition: vehicle recording environment @en
definition: environnement d'enregistrement en véhicule @fr
definition: ambiente di registrazione in auto @it
definition: voertuig opname omgeving @nl
preferred label: vehicle @en
preferred label: véhicule @fr
preferred label: veicolo @it
preferred label: voertuig @nl
top concept of: SSHOC Multilingual Metadata

δημόσιος χώρος
type: Concept
source: CLARIN
definition: περιβάλλον ηχογράφησης σε δημόσιο χώρο
definition: public place recording environment @en
definition: environnement d'enregistrement dans les lieux publics. @fr
definition: ambiente di registrazione in luogo pubblico @it
definition: openbare plaats opnameomgeving @nl
preferred label: public place @en
preferred label: espace public @fr
preferred label: spazio pubblico @it
preferred label: openbare plaats @nl
top concept of: SSHOC Multilingual Metadata

αληθής
type: Concept
source: Oxford English Dictionary
definition: Συμφωνεί με ένα πρότυπο, μοτίβο ή κανόνα- ακριβές, συγκεκριμένο, σωστό
definition: Agreeing with a standard, pattern, or rule; exact, accurate, precise; correct, right @en
definition: En accord avec une norme, un modèle ou une règle ; exact, précis, exact ; correct, juste. @fr
definition: D'accordo con uno standard, un modello o una regola; esatto, accurato, preciso; corretto, giusto @it
definition: Overeenkomen met een standaard, patroon of regel; exact, nauwkeurig, precies; juist, juist @nl
preferred label: true @en
preferred label: vrai @fr
preferred label: vero @it
preferred label: waar @nl
top concept of: SSHOC Multilingual Metadata

ψευδές
type: Concept
source: Oxford English Dictionary
definition: Σε αντίθεση με αυτό που είναι αληθές, λανθασμένο.
definition: Contrary to what is true, erroneous. @en
definition: Contraire à ce qui est vrai, erroné. @fr
definition: Contrario a ciò che è vero, errato. @it
definition: In tegenstelling tot wat waar is, foutief. @nl
preferred label: false @en
preferred label: faux @fr
preferred label: falso @it
preferred label: onwaar @nl
top concept of: SSHOC Multilingual Metadata

ηλικία
type: Concept
source: www.macmillandictionary.com (2010-07-22
definition: Ο αριθμός των ετών που έχει ζήσει κάποιος.
definition: The number of years that someone has lived. @en
definition: Le nombre d'années de vie d'une personne. @fr
definition: Il numero di anni che qualcuno ha vissuto. @it
definition: Het aantal jaren dat iemand heeft geleefd. @nl
preferred label: age @en
preferred label: âge @fr
preferred label: età @it
preferred label: leeftijd @nl
top concept of: SSHOC Multilingual Metadata

Τοπωνύμιο
type: Concept
source: Dirk Roorda
definition: Το όνομα μιας διοικητικής ή γεωγραφικής μονάδας σε επίπεδο χωριών, πόλεων και κωμοπόλεων.
definition: The name of an administrative or geographical unit at the level of villages, towns and cities. @en
definition: Le nom d'une unité administrative ou géographique au niveau des villages, des villes et des cités. @fr
definition: Il nome di un'unità amministrativa o geografica a livello di villaggi, paesi e città. @it
definition: De naam van een administratieve of geografische eenheid op het niveau van dorpen, steden en gemeenten. @nl
preferred label: place name @en
preferred label: nom du lieu @fr
preferred label: nome del luogo @it
preferred label: plaatsnaam @nl
top concept of: SSHOC Multilingual Metadata

όνομα περιοχής
type: Concept
source: Dirk Roorda
definition: Η ονομασία μιας διοικητικής ή γεωγραφικής μονάδας μεταξύ (όχι συμπεριλαμβανομένων) των επιπέδων των πόλεων και των χωρών.
definition: The name of an administrative or geographical unit between (not including) the levels of cities and countries. @en
definition: Le nom d'une unité administrative ou géographique entre les niveaux des villes et des pays (non compris). @fr
definition: Il nome di un'unità amministrativa o geografica tra (non incluso) i livelli di città e paesi. @it
definition: De naam van een administratieve of geografische eenheid tussen (niet inbegrepen) de niveaus van steden en landen. @nl
preferred label: district name @en
preferred label: nom du district @fr
preferred label: nome del distretto @it
preferred label: districtsnaam @nl
top concept of: SSHOC Multilingual Metadata

Βιβλίο της Βίβλου
type: Concept
source: Dirk Roorda
definition: Το όνομα της κύριας μονάδας διαίρεσης στη Βίβλο.
definition: Name of main unit of division in the Bible. @en
definition: Nom de la principale unité de division dans la Bible. @fr
definition: Nome dell'unità principale di divisione nella Bibbia. @it
definition: Naam van de hoofdeenheid van de deling in de Bijbel. @nl
preferred label: Bible book @en
preferred label: livre de la bible @fr
preferred label: libro della Bibbia @it
preferred label: Bijbelboek @nl
top concept of: SSHOC Multilingual Metadata

κεφάλαιο της Βίβλου
type: Concept
source: Dirk Roorda
definition: Αριθμός της κύριας μονάδας διαίρεσης σε ένα βιβλίο της Βίβλου.
definition: Number of main unit of division in a Bible book. @en
definition: Numéro de l'unité principale de division dans un livre biblique. @fr
definition: Numero dell'unità principale di divisione in un libro della Bibbia. @it
definition: Nummer van hoofdafdelingseenheid in een Bijbelboek. @nl
preferred label: Bible chapter @en
preferred label: chapitre de la Bible @fr
preferred label: capitolo della Bibbia @it
preferred label: Bijbelhoofdstuk @nl
top concept of: SSHOC Multilingual Metadata

εδάφιο της Βίβλου
type: Concept
source: Dirk Roorda
definition: Αριθμός της κύριας μονάδας διαίρεσης σε ένα κεφάλαιο της Βίβλου.
definition: Number of main unit of division in a Bible chapter. @en
definition: Numéro de l'unité principale de division dans un chapitre de la Bible. @fr
definition: Numero dell'unità principale di divisione in un capitolo della Bibbia. @it
definition: Nummer van de hoofdafdeling in een hoofdstuk van de Bijbel. @nl
preferred label: Bible verse @en
preferred label: verset biblique @fr
preferred label: versetto della Bibbia @it
preferred label: Bijbelvers @nl
top concept of: SSHOC Multilingual Metadata

ημιστίχιο της Βίβλου
type: Concept
source: Dirk Roorda
definition: Ονομασία υποδιαίρεσης ενός στίχου της Βίβλου
definition: Label of subdivision of a verse in the Bible. @en
definition: Etiquette de subdivision d'un verset de la Bible. @fr
definition: Etichetta di suddivisione di un versetto nella Bibbia. @it
definition: Label van de onderverdeling van een vers in de Bijbel. @nl
preferred label: Bible half-verse @en
preferred label: demi-verset biblique @fr
preferred label: mezzo versetto della Bibbia @it
preferred label: Sectie in een Bijbelhoofdstuk @nl
top concept of: SSHOC Multilingual Metadata

ρυθμός bit
type: Concept
source: (https://en.wikipedia.org/w/index.php?title=Bit_rate&oldid=831277980
definition: Ο αριθμός των bits που μεταφέρονται ή υποβάλλονται σε επεξεργασία ανά μονάδα χρόνου. (https://en.wikipedia.org/w/index.php?title=Bit_rate&oldid=831277980)
definition: The number of bits that are conveyed or processed per unit of time. (https://en.wikipedia.org/w/index.php?title=Bit_rate&oldid=831277980) @en
definition: Le nombre de bits qui sont transmis ou traités par unité de temps. (https://en.wikipedia.org/w/index.php?title=Bit_rate&oldid=831277980) @fr
definition: Il numero di bit che vengono trasmessi o elaborati per unità di tempo. (https://en.wikipedia.org/w/index.php?title=Bit_rate&oldid=831277980) @it
definition: Het aantal bits dat per tijdseenheid wordt overgebracht of verwerkt. (https://en.wikipedia.org/w/index.php?title=Bit_rate&oldid=831277980) @nl
preferred label: bit rate @en
preferred label: débit binaire @fr
preferred label: bitsnelheid @nl
top concept of: SSHOC Multilingual Metadata

χρωματικό μοντέλο
type: Concept
source: (based on https://en.wikipedia.org/wiki/Color_model
definition: Ένα χρωματικό μοντέλο είναι ένα μαθηματικό μοντέλο που καθορίζει τον τρόπο αναπαράστασης των χρωμάτων σε ένα δεδομένο μέσο π.χ. βίντεο ή αρχείο γραφικών. (με βάση το https://en.wikipedia.org/wiki/Color_model)
definition: A colour model is a mathematical model defining how colours in a given medium e.g. video or graphic file are represented. (based on https://en.wikipedia.org/wiki/Color_model) @en
definition: Un modèle de couleur est un modèle mathématique définissant la manière dont les couleurs sont représentées sur un support donné, par exemple un fichier vidéo ou graphique. (basé sur https://en.wikipedia.org/wiki/Color_model) @fr
definition: Un modello di colore è un modello matematico che definisce come vengono rappresentati i colori in un dato mezzo, ad esempio un video o un file grafico. (basato su https://en.wikipedia.org/wiki/Color_model) @it
definition: Een kleurmodel is een wiskundig model dat bepaalt hoe kleuren in een bepaald medium, bv. een video of grafisch bestand, worden weergegeven. (gebaseerd op https://en.wikipedia.org/wiki/Color_model) @nl
preferred label: color model @en
preferred label: modèle de couleur @fr
preferred label: modello di colore @it
preferred label: kleurenmodel @nl
top concept of: SSHOC Multilingual Metadata

χρωματικός χώρος
type: Concept
source: https://en.wikipedia.org/wiki/Color_space
definition: Ο χρωματικός χώρος συνδυάζει ένα χρωματικό μοντέλο με μια συνάρτηση απεικόνισης για την αναπαράσταση των χρωμάτων σε ένα δεδομένο μέσο.
definition: Color space combines a color model with a mapping function to represent colors in a given medium. @en
definition: L'espace couleur combine un modèle de couleur avec une fonction de mappage pour représenter les couleurs dans un support donné. @fr
definition: Lo spazio di colore combina un modello di colore con una funzione di mappatura per rappresentare i colori in un dato mezzo. @it
definition: Kleurruimte combineert een kleurenmodel met een mapping-functie om kleuren in een bepaald medium weer te geven. @nl
preferred label: color space @en
preferred label: espace couleur @fr
preferred label: spazio di colore @it
preferred label: kleur ruimte @nl
top concept of: SSHOC Multilingual Metadata

SSHOC Multilingual Metadata
type: ConceptScheme
description: SSHOC Multilingual Metadata is based on the metadata set of the CLARIN Concept Registry (CCR). The CCR 232 approved metadata concepts, as well as their definitions, were automatically translated into several languages (Dutch, French, Greek, Italian) thanks to the support of Machine Translation tools, and eventually validated by native speakers who were also expert of the domain. This resource was created within the frame of the SSHOC (Social Sciences and Humanities Open Cloud) project (H2020-INFRAEOSC-2018-2-823782). It is the result of the work of Task 3.1.3 "creating Multilingual metadata and taxonomies for discovery", as described in D3.9, carried out jointly by ILC-CNR and CLARIN ERIC. @en
identifier: CLARIN resource identifier: http://hdl.handle.net/20.500.11752/ILC-568 @en
created: 2021-11-29
language: iso639-3dut
language: iso639-3ell
language: iso639-3eng
language: iso639-3fra
language: iso639-3ger
language: iso639-3ita
language: iso639-3slv
modified: 2021-12-17
version info: 1.0